Fix: correctly handle buffering of filter computations (not relying on parent stream buffered data)

8 jobs for fix_stream_filter_buffering in 4 minutes and 34 seconds (queued for 1 second)
Status Name Job ID Coverage
  Build
failed build_linux_36 #208217
docker

00:04:34

failed build_linux_37 #208218
docker

00:04:29

failed build_macosx_36 #208219
macosx

00:04:23

failed build_macosx_37 #208220
macosx

00:04:18

canceled build_linux_36 #208215
docker

00:01:12

canceled build_linux_37 #208216
docker

00:01:12

canceled build_macosx_36 #208213
macosx

00:01:12

canceled build_macosx_37 #208214
macosx

00:01:13

 
Name Stage Failure
failed
build_macosx_37 Build
Tests failed for bob.io.stream-0.0.1b0-py37hfea3108_4.conda - moving package to /Users/gitlab/builds/b6d3167a/1/bob/bob.io.stream/miniconda/conda-bld/broken
WARNING conda_build.build:tests_failed(2923): Tests failed for bob.io.stream-0.0.1b0-py37hfea3108_4.conda - moving package to /Users/gitlab/builds/b6d3167a/1/bob/bob.io.stream/miniconda/conda-bld/broken
TESTS FAILED: bob.io.stream-0.0.1b0-py37hfea3108_4.conda
Uploading artifacts for failed job
Uploading artifacts...
Runtime platform
arch=amd64 os=darwin pid=15767 revision=738bbe5a version=13.3.1
WARNING: coverage.xml: no matching files
ERROR: No files to upload
ERROR: Job failed: exit status 1
failed
build_macosx_36 Build
Tests failed for bob.io.stream-0.0.1b0-py36hfea3108_4.conda - moving package to /Users/gitlab/builds/b6d3167a/0/bob/bob.io.stream/miniconda/conda-bld/broken
WARNING conda_build.build:tests_failed(2923): Tests failed for bob.io.stream-0.0.1b0-py36hfea3108_4.conda - moving package to /Users/gitlab/builds/b6d3167a/0/bob/bob.io.stream/miniconda/conda-bld/broken
TESTS FAILED: bob.io.stream-0.0.1b0-py36hfea3108_4.conda
Uploading artifacts for failed job
Uploading artifacts...
Runtime platform
arch=amd64 os=darwin pid=15800 revision=738bbe5a version=13.3.1
WARNING: coverage.xml: no matching files
ERROR: No files to upload
ERROR: Job failed: exit status 1
failed
build_linux_37 Build
FAILED (failures=1)
Tests failed for bob.io.stream-0.0.1b0-py37hfea3108_4.conda - moving package to /scratch/builds/bob/bob.io.stream/miniconda/conda-bld/broken
WARNING conda_build.build:tests_failed(2923): Tests failed for bob.io.stream-0.0.1b0-py37hfea3108_4.conda - moving package to /scratch/builds/bob/bob.io.stream/miniconda/conda-bld/broken
TESTS FAILED: bob.io.stream-0.0.1b0-py37hfea3108_4.conda
Uploading artifacts for failed job
Uploading artifacts...
WARNING: coverage.xml: no matching files
ERROR: No files to upload
ERROR: Job failed: exit code 1
failed
build_linux_36 Build
FAILED (failures=1)
Tests failed for bob.io.stream-0.0.1b0-py36hfea3108_4.conda - moving package to /scratch/builds/bob/bob.io.stream/miniconda/conda-bld/broken
WARNING conda_build.build:tests_failed(2923): Tests failed for bob.io.stream-0.0.1b0-py36hfea3108_4.conda - moving package to /scratch/builds/bob/bob.io.stream/miniconda/conda-bld/broken
TESTS FAILED: bob.io.stream-0.0.1b0-py36hfea3108_4.conda
Uploading artifacts for failed job
Uploading artifacts...
WARNING: coverage.xml: no matching files
ERROR: No files to upload
ERROR: Job failed: exit code 1