This might have solved the dask issue

4 jobs for arcface in 13 minutes and 22 seconds (queued for 4 seconds)
latest
Name Stage Failure
failed
build_macosx_37 Build
WARNING:conda_build.build:Tests failed for bob.ip.tensorflow_extractor-0.0.7b0-py37h7596372_47.conda - moving package to /Users/gitlab/builds/f6f95b82/1/bob/bob.ip.tensorflow_extractor/miniconda/conda-bld/broken
TESTS FAILED: bob.ip.tensorflow_extractor-0.0.7b0-py37h7596372_47.conda
Running after_script
Uploading artifacts for failed job
Uploading artifacts...
Runtime platform
arch=amd64 os=darwin pid=88764 revision=c5874a4b version=12.10.2
WARNING: coverage.xml: no matching files
ERROR: No files to upload
ERROR: Job failed: exit status 1
failed
build_linux_37 Build
Tests failed for bob.ip.tensorflow_extractor-0.0.7b0-py37h7596372_46.conda - moving package to /scratch/builds/bob/bob.ip.tensorflow_extractor/miniconda/conda-bld/broken
WARNING:conda_build.build:Tests failed for bob.ip.tensorflow_extractor-0.0.7b0-py37h7596372_46.conda - moving package to /scratch/builds/bob/bob.ip.tensorflow_extractor/miniconda/conda-bld/broken
TESTS FAILED: bob.ip.tensorflow_extractor-0.0.7b0-py37h7596372_46.conda
Running after_script
Uploading artifacts for failed job
Uploading artifacts...
WARNING: coverage.xml: no matching files
ERROR: No files to upload
ERROR: Job failed: exit code 1
failed
build_linux_36 Build
Tests failed for bob.ip.tensorflow_extractor-0.0.7b0-py36h7596372_47.conda - moving package to /scratch/builds/bob/bob.ip.tensorflow_extractor/miniconda/conda-bld/broken
WARNING:conda_build.build:Tests failed for bob.ip.tensorflow_extractor-0.0.7b0-py36h7596372_47.conda - moving package to /scratch/builds/bob/bob.ip.tensorflow_extractor/miniconda/conda-bld/broken
TESTS FAILED: bob.ip.tensorflow_extractor-0.0.7b0-py36h7596372_47.conda
Running after_script
Uploading artifacts for failed job
Uploading artifacts...
WARNING: coverage.xml: no matching files
ERROR: No files to upload
ERROR: Job failed: exit code 1
failed
build_macosx_36 Build
WARNING:conda_build.build:Tests failed for bob.ip.tensorflow_extractor-0.0.7b0-py36h7596372_47.conda - moving package to /Users/gitlab/builds/f6f95b82/0/bob/bob.ip.tensorflow_extractor/miniconda/conda-bld/broken
TESTS FAILED: bob.ip.tensorflow_extractor-0.0.7b0-py36h7596372_47.conda
Running after_script
Uploading artifacts for failed job
Uploading artifacts...
Runtime platform
arch=amd64 os=darwin pid=88783 revision=c5874a4b version=12.10.2
WARNING: coverage.xml: no matching files
ERROR: No files to upload
ERROR: Job failed: exit status 1