bob.pipelines as requiriments

4 jobs for new_protocol in 3 minutes and 31 seconds (queued for 3 seconds)
Name Stage Failure
failed
build_macosx_36 Build
WARNING:conda_build.build:Tests failed for bob.db.morph-0.0.1b0-py36h1efc47c_0.conda - moving package to /Users/gitlab/builds/b6d3167a/0/bob/bob.db.morph/miniconda/conda-bld/broken
TESTS FAILED: bob.db.morph-0.0.1b0-py36h1efc47c_0.conda
Running after_script
Uploading artifacts for failed job
Uploading artifacts...
Runtime platform
arch=amd64 os=darwin pid=27570 revision=c5874a4b version=12.10.2
WARNING: coverage.xml: no matching files
ERROR: No files to upload
ERROR: Job failed: exit status 1
failed
build_linux_37 Build
Tests failed for bob.db.morph-0.0.1b0-py37h1efc47c_0.conda - moving package to /scratch/builds/bob/bob.db.morph/miniconda/conda-bld/broken
WARNING:conda_build.build:Tests failed for bob.db.morph-0.0.1b0-py37h1efc47c_0.conda - moving package to /scratch/builds/bob/bob.db.morph/miniconda/conda-bld/broken
TESTS FAILED: bob.db.morph-0.0.1b0-py37h1efc47c_0.conda
Running after_script
Uploading artifacts for failed job
Uploading artifacts...
WARNING: coverage.xml: no matching files
ERROR: No files to upload
ERROR: Job failed: exit code 1
failed
build_linux_36 Build
Tests failed for bob.db.morph-0.0.1b0-py36h1efc47c_0.conda - moving package to /scratch/builds/bob/bob.db.morph/miniconda/conda-bld/broken
WARNING:conda_build.build:Tests failed for bob.db.morph-0.0.1b0-py36h1efc47c_0.conda - moving package to /scratch/builds/bob/bob.db.morph/miniconda/conda-bld/broken
TESTS FAILED: bob.db.morph-0.0.1b0-py36h1efc47c_0.conda
Running after_script
Uploading artifacts for failed job
Uploading artifacts...
WARNING: coverage.xml: no matching files
ERROR: No files to upload
ERROR: Job failed: exit code 1
failed
build_macosx_37 Build
WARNING:conda_build.build:Tests failed for bob.db.morph-0.0.1b0-py37h1efc47c_0.conda - moving package to /Users/gitlab/builds/b6d3167a/1/bob/bob.db.morph/miniconda/conda-bld/broken
TESTS FAILED: bob.db.morph-0.0.1b0-py37h1efc47c_0.conda
Running after_script
Uploading artifacts for failed job
Uploading artifacts...
Runtime platform
arch=amd64 os=darwin pid=27524 revision=c5874a4b version=12.10.2
WARNING: coverage.xml: no matching files
ERROR: No files to upload
ERROR: Job failed: exit status 1