[py] Added Z and T normalization objects

4 jobs for add-norm in 8 minutes and 8 seconds (queued for 6 seconds)
Name Stage Failure
failed
build_macosx_36 Build
WARNING:conda_build.build:Tests failed for bob.db.morph-0.0.1b0-py36hdc21d39_0.conda - moving package to /Users/gitlab/builds/f6f95b82/0/bob/bob.db.morph/miniconda/conda-bld/broken
TESTS FAILED: bob.db.morph-0.0.1b0-py36hdc21d39_0.conda
Running after_script
Uploading artifacts for failed job
Uploading artifacts...
Runtime platform
arch=amd64 os=darwin pid=26789 revision=4c96e5ad version=12.9.0
WARNING: coverage.xml: no matching files
ERROR: No files to upload
ERROR: Job failed: exit status 1
failed
build_linux_36 Build
Tests failed for bob.db.morph-0.0.1b0-py36hdc21d39_0.conda - moving package to /scratch/builds/bob/bob.db.morph/miniconda/conda-bld/broken
WARNING:conda_build.build:Tests failed for bob.db.morph-0.0.1b0-py36hdc21d39_0.conda - moving package to /scratch/builds/bob/bob.db.morph/miniconda/conda-bld/broken
TESTS FAILED: bob.db.morph-0.0.1b0-py36hdc21d39_0.conda
Running after_script
Uploading artifacts for failed job
Uploading artifacts...
WARNING: coverage.xml: no matching files
ERROR: No files to upload
ERROR: Job failed: exit code 1
failed
build_macosx_37 Build
WARNING:conda_build.build:Tests failed for bob.db.morph-0.0.1b0-py37hdc21d39_0.conda - moving package to /Users/gitlab/builds/f6f95b82/1/bob/bob.db.morph/miniconda/conda-bld/broken
TESTS FAILED: bob.db.morph-0.0.1b0-py37hdc21d39_0.conda
Running after_script
Uploading artifacts for failed job
Uploading artifacts...
Runtime platform
arch=amd64 os=darwin pid=26772 revision=4c96e5ad version=12.9.0
WARNING: coverage.xml: no matching files
ERROR: No files to upload
ERROR: Job failed: exit status 1
failed
build_linux_37 Build
Tests failed for bob.db.morph-0.0.1b0-py37hdc21d39_0.conda - moving package to /scratch/builds/bob/bob.db.morph/miniconda/conda-bld/broken
WARNING:conda_build.build:Tests failed for bob.db.morph-0.0.1b0-py37hdc21d39_0.conda - moving package to /scratch/builds/bob/bob.db.morph/miniconda/conda-bld/broken
TESTS FAILED: bob.db.morph-0.0.1b0-py37hdc21d39_0.conda
Running after_script
Uploading artifacts for failed job
Uploading artifacts...
WARNING: coverage.xml: no matching files
ERROR: No files to upload
ERROR: Job failed: exit code 1