Merge branch 'vuln-csv' into 'master'

Vulnerability framework - CSV datasets

See merge request !106
4 jobs for fix-ijbc in 239 minutes and 27 seconds (queued for 1 second)
Status Name Job ID Coverage
  Build
failed build_linux_37 #234712
docker

03:59:20

72.0%
failed build_linux_38 #234713
docker

03:54:44

73.0%
failed build_macos_intel_37 #234710
macos intel

02:32:42

66.0%
failed build_macos_intel_38 #234711
macos intel

02:29:12

66.0%
 
Name Stage Failure
failed
build_linux_38 Build
===== 8 failed, 38 passed, 8 skipped, 873 warnings in 13709.78s (3:48:29) ======
Tests failed for bob.bio.face-5.0.1b0-py38h083fc0b_47.conda - moving package to /scratch/builds/bob/bob.bio.face/miniconda/conda-bld/broken
TESTS FAILED: bob.bio.face-5.0.1b0-py38h083fc0b_47.conda
Uploading artifacts for failed job
Uploading artifacts...
coverage.xml: found 1 matching files and directories

Uploading artifacts as "cobertura" to coordinator... ok
id=234713 responseStatus=201 Created token=vcenwehy
Cleaning up file based variables
ERROR: Job failed: exit code 1
failed
build_linux_37 Build
===== 8 failed, 38 passed, 8 skipped, 873 warnings in 13990.59s (3:53:10) ======
Tests failed for bob.bio.face-5.0.1b0-py37h083fc0b_50.conda - moving package to /scratch/builds/bob/bob.bio.face/miniconda/conda-bld/broken
TESTS FAILED: bob.bio.face-5.0.1b0-py37h083fc0b_50.conda
Uploading artifacts for failed job
Uploading artifacts...
coverage.xml: found 1 matching files and directories

Uploading artifacts as "cobertura" to coordinator... ok
id=234712 responseStatus=201 Created token=8J2FsZLY
Cleaning up file based variables
ERROR: Job failed: exit code 1
failed
build_macos_intel_38 Build
Tests failed for bob.bio.face-5.0.1b0-py38h301c2a9_45.conda - moving package to /Users/gitlab/builds/nrU4yQP1/1/bob/bob.bio.face/miniconda/conda-bld/broken
TESTS FAILED: bob.bio.face-5.0.1b0-py38h301c2a9_45.conda
Uploading artifacts for failed job
Uploading artifacts...
Runtime platform
arch=amd64 os=darwin pid=8953 revision=7a6612da version=13.12.0
coverage.xml: found 1 matching files and directories

Uploading artifacts as "cobertura" to coordinator... ok
id=234711 responseStatus=201 Created token=sUQwzMX4
Cleaning up file based variables
ERROR: Job failed: exit status 1
failed
build_macos_intel_37 Build
Tests failed for bob.bio.face-5.0.1b0-py37h301c2a9_44.conda - moving package to /Users/gitlab/builds/nrU4yQP1/0/bob/bob.bio.face/miniconda/conda-bld/broken
TESTS FAILED: bob.bio.face-5.0.1b0-py37h301c2a9_44.conda
Uploading artifacts for failed job
Uploading artifacts...
Runtime platform
arch=amd64 os=darwin pid=9672 revision=7a6612da version=13.12.0
coverage.xml: found 1 matching files and directories

Uploading artifacts as "cobertura" to coordinator... ok
id=234710 responseStatus=201 Created token=mbVhyKsu
Cleaning up file based variables
ERROR: Job failed: exit status 1