[fix] verbosity of vanilla-biometrics

4 jobs for dask-pipelines in 7 minutes and 51 seconds (queued for 3 seconds)
Name Stage Failure
failed
build_linux_36 Build
  File "/scratch/builds/bob/bob.bio.base/miniconda/conda-bld/bob.bio.base_1582558688271/_test_env_placehold_placehold_placehold_placehold_placehold_placehold_placehold_placehold_placehold_placehold_placehold_placehold_placehold_placehold_placehold_placehold_pla/lib/python3.6/site-packages/bob/bio/base/algorithm/__init__.py", line 3, in <module>
from .PCA import PCA
File "/scratch/builds/bob/bob.bio.base/miniconda/conda-bld/bob.bio.base_1582558688271/_test_env_placehold_placehold_placehold_placehold_placehold_placehold_placehold_placehold_placehold_placehold_placehold_placehold_placehold_placehold_placehold_placehold_pla/lib/python3.6/site-packages/bob/bio/base/algorithm/PCA.py", line 7, in <module>
import sklearn.decomposition
ModuleNotFoundError: No module named 'sklearn'
Tests failed for bob.bio.base-4.0.3b0-py36h03d05df_0.conda - moving package to /scratch/builds/bob/bob.bio.base/miniconda/conda-bld/broken
WARNING:conda_build.build:Tests failed for bob.bio.base-4.0.3b0-py36h03d05df_0.conda - moving package to /scratch/builds/bob/bob.bio.base/miniconda/conda-bld/broken
TESTS FAILED: bob.bio.base-4.0.3b0-py36h03d05df_0.conda
ERROR: Job failed: exit code 1
failed
build_macosx_36 Build
  File "/Users/gitlab/builds/f6f95b82/0/bob/bob.bio.base/miniconda/conda-bld/bob.bio.base_1582558804172/_test_env_placehold_placehold_placehold_placehold_placehold_placehold_placehold_placehold_placehold_placehold_placehold_placehold_placehold_placehold_placeho/lib/python3.6/site-packages/bob/bio/base/algorithm/__init__.py", line 3, in <module>
from .PCA import PCA
File "/Users/gitlab/builds/f6f95b82/0/bob/bob.bio.base/miniconda/conda-bld/bob.bio.base_1582558804172/_test_env_placehold_placehold_placehold_placehold_placehold_placehold_placehold_placehold_placehold_placehold_placehold_placehold_placehold_placehold_placeho/lib/python3.6/site-packages/bob/bio/base/algorithm/PCA.py", line 7, in <module>
import sklearn.decomposition
ModuleNotFoundError: No module named 'sklearn'
Tests failed for bob.bio.base-4.0.3b0-py36h03d05df_0.conda - moving package to /Users/gitlab/builds/f6f95b82/0/bob/bob.bio.base/miniconda/conda-bld/broken
WARNING:conda_build.build:Tests failed for bob.bio.base-4.0.3b0-py36h03d05df_0.conda - moving package to /Users/gitlab/builds/f6f95b82/0/bob/bob.bio.base/miniconda/conda-bld/broken
TESTS FAILED: bob.bio.base-4.0.3b0-py36h03d05df_0.conda
ERROR: Job failed: exit status 1
failed
build_linux_37 Build
  File "/scratch/builds/bob/bob.bio.base/miniconda/conda-bld/bob.bio.base_1582558686985/_test_env_placehold_placehold_placehold_placehold_placehold_placehold_placehold_placehold_placehold_placehold_placehold_placehold_placehold_placehold_placehold_placehold_pla/lib/python3.7/site-packages/bob/bio/base/algorithm/__init__.py", line 3, in <module>
from .PCA import PCA
File "/scratch/builds/bob/bob.bio.base/miniconda/conda-bld/bob.bio.base_1582558686985/_test_env_placehold_placehold_placehold_placehold_placehold_placehold_placehold_placehold_placehold_placehold_placehold_placehold_placehold_placehold_placehold_placehold_pla/lib/python3.7/site-packages/bob/bio/base/algorithm/PCA.py", line 7, in <module>
import sklearn.decomposition
ModuleNotFoundError: No module named 'sklearn'
Tests failed for bob.bio.base-4.0.3b0-py37h03d05df_0.conda - moving package to /scratch/builds/bob/bob.bio.base/miniconda/conda-bld/broken
WARNING:conda_build.build:Tests failed for bob.bio.base-4.0.3b0-py37h03d05df_0.conda - moving package to /scratch/builds/bob/bob.bio.base/miniconda/conda-bld/broken
TESTS FAILED: bob.bio.base-4.0.3b0-py37h03d05df_0.conda
ERROR: Job failed: exit code 1
failed
build_macosx_37 Build
  File "/Users/gitlab/builds/f6f95b82/1/bob/bob.bio.base/miniconda/conda-bld/bob.bio.base_1582558799388/_test_env_placehold_placehold_placehold_placehold_placehold_placehold_placehold_placehold_placehold_placehold_placehold_placehold_placehold_placehold_placeho/lib/python3.7/site-packages/bob/bio/base/algorithm/__init__.py", line 3, in <module>
from .PCA import PCA
File "/Users/gitlab/builds/f6f95b82/1/bob/bob.bio.base/miniconda/conda-bld/bob.bio.base_1582558799388/_test_env_placehold_placehold_placehold_placehold_placehold_placehold_placehold_placehold_placehold_placehold_placehold_placehold_placehold_placehold_placeho/lib/python3.7/site-packages/bob/bio/base/algorithm/PCA.py", line 7, in <module>
import sklearn.decomposition
ModuleNotFoundError: No module named 'sklearn'
Tests failed for bob.bio.base-4.0.3b0-py37h03d05df_0.conda - moving package to /Users/gitlab/builds/f6f95b82/1/bob/bob.bio.base/miniconda/conda-bld/broken
WARNING:conda_build.build:Tests failed for bob.bio.base-4.0.3b0-py37h03d05df_0.conda - moving package to /Users/gitlab/builds/f6f95b82/1/bob/bob.bio.base/miniconda/conda-bld/broken
TESTS FAILED: bob.bio.base-4.0.3b0-py37h03d05df_0.conda
ERROR: Job failed: exit status 1