[mirror] Implement download retries with random pauses

5 jobs for master in 2 minutes and 56 seconds (queued for 2 seconds)
Status Name Job ID Coverage
  Build
failed build_linux_36 #178303
docker

00:02:13

failed build_linux_37 #178304
docker

00:01:50

failed build_macosx_36 #178305
macosx

00:02:56

failed build_macosx_37 #178306
macosx

00:01:25

 
  Deploy
skipped deploy_beta #178307
docker
 
Name Stage Failure
failed
build_macosx_37 Build
  File "$PREFIX/lib/python3.7/site-packages/bob/devtools/mirror.py", line 243
os.unlink(temp_dest)
^
SyntaxError: invalid syntax

Tests failed for bob.devtools-2.0.2b0-py37h661208a_3.tar.bz2 - moving package to /Users/gitlab/builds/b6d3167a/0/bob/bob.devtools/miniconda/conda-bld/broken
WARNING conda_build.build:tests_failed(2226): Tests failed for bob.devtools-2.0.2b0-py37h661208a_3.tar.bz2 - moving package to /Users/gitlab/builds/b6d3167a/0/bob/bob.devtools/miniconda/conda-bld/broken
TESTS FAILED: bob.devtools-2.0.2b0-py37h661208a_3.tar.bz2
ERROR: Job failed: exit status 1
failed
build_macosx_36 Build
  File "$PREFIX/lib/python3.6/site-packages/bob/devtools/mirror.py", line 243
os.unlink(temp_dest)
^
SyntaxError: invalid syntax

Tests failed for bob.devtools-2.0.2b0-py36h661208a_3.tar.bz2 - moving package to /Users/gitlab/builds/f6f95b82/0/bob/bob.devtools/miniconda/conda-bld/broken
WARNING conda_build.build:tests_failed(2226): Tests failed for bob.devtools-2.0.2b0-py36h661208a_3.tar.bz2 - moving package to /Users/gitlab/builds/f6f95b82/0/bob/bob.devtools/miniconda/conda-bld/broken
TESTS FAILED: bob.devtools-2.0.2b0-py36h661208a_3.tar.bz2
ERROR: Job failed: exit status 1
failed
build_linux_37 Build
  File "$PREFIX/lib/python3.7/site-packages/bob/devtools/mirror.py", line 243
os.unlink(temp_dest)
^
SyntaxError: invalid syntax

Tests failed for bob.devtools-2.0.2b0-py37h661208a_3.tar.bz2 - moving package to /scratch/builds/bob/bob.devtools/miniconda/conda-bld/broken
WARNING conda_build.build:tests_failed(2226): Tests failed for bob.devtools-2.0.2b0-py37h661208a_3.tar.bz2 - moving package to /scratch/builds/bob/bob.devtools/miniconda/conda-bld/broken
TESTS FAILED: bob.devtools-2.0.2b0-py37h661208a_3.tar.bz2
ERROR: Job failed: exit code 1
failed
build_linux_36 Build
  File "$PREFIX/lib/python3.6/site-packages/bob/devtools/mirror.py", line 243
os.unlink(temp_dest)
^
SyntaxError: invalid syntax

Tests failed for bob.devtools-2.0.2b0-py36h661208a_3.tar.bz2 - moving package to /scratch/builds/bob/bob.devtools/miniconda/conda-bld/broken
WARNING conda_build.build:tests_failed(2226): Tests failed for bob.devtools-2.0.2b0-py36h661208a_3.tar.bz2 - moving package to /scratch/builds/bob/bob.devtools/miniconda/conda-bld/broken
TESTS FAILED: bob.devtools-2.0.2b0-py36h661208a_3.tar.bz2
ERROR: Job failed: exit code 1