MIniconda 3

4 jobs for bump-conda-build in 10 minutes and 34 seconds (queued for 2 seconds)
Status Name Job ID Coverage
  Build
failed build_linux_36 #176312
docker

00:03:21

failed build_linux_37 #176313
docker

00:04:26

failed build_macosx_36 #176314
macosx

00:10:34

failed build_macosx_37 #176315
macosx

00:09:29

 
Name Stage Failure
failed
build_macosx_37 Build
export SRC_DIR=/Users/gitlab/builds/f6f95b82/1/bob/bob.devtools/miniconda/conda-bld/bob.devtools_1570613666269/test_tmp
import: 'bob.devtools'
import: 'bob.devtools'
+ bdt -h
/Users/gitlab/builds/f6f95b82/1/bob/bob.devtools/miniconda/conda-bld/bob.devtools_1570613666269/test_tmp/run_test.sh: /Users/gitlab/builds/f6f95b82/1/bob/bob.devtools/miniconda/conda-bld/bob.devtools_1570613666269/_test_env_placehold_placehold_placehold_placehold_placehold_placehold_placehold_placehold_placehold_placehold_placehold_placehold_placehold_placehold_placeho/bin/bdt: /Users/gitlab/builds/f6f95b82/1/bob/bob.devtools/miniconda/conda-bld/bob.devto: bad interpreter: No such file or directory
Tests failed for bob.devtools-2.0.1b0-py37h661208a_5.tar.bz2 - moving package to /Users/gitlab/builds/f6f95b82/1/bob/bob.devtools/miniconda/conda-bld/broken
WARNING conda_build.build:tests_failed(2230): Tests failed for bob.devtools-2.0.1b0-py37h661208a_5.tar.bz2 - moving package to /Users/gitlab/builds/f6f95b82/1/bob/bob.devtools/miniconda/conda-bld/broken
TESTS FAILED: bob.devtools-2.0.1b0-py37h661208a_5.tar.bz2
ERROR: Job failed: exit status 1
failed
build_macosx_36 Build
export SRC_DIR=/Users/gitlab/builds/f6f95b82/0/bob/bob.devtools/miniconda/conda-bld/bob.devtools_1570613724320/test_tmp
import: 'bob.devtools'
import: 'bob.devtools'
+ bdt -h
/Users/gitlab/builds/f6f95b82/0/bob/bob.devtools/miniconda/conda-bld/bob.devtools_1570613724320/test_tmp/run_test.sh: /Users/gitlab/builds/f6f95b82/0/bob/bob.devtools/miniconda/conda-bld/bob.devtools_1570613724320/_test_env_placehold_placehold_placehold_placehold_placehold_placehold_placehold_placehold_placehold_placehold_placehold_placehold_placehold_placehold_placeho/bin/bdt: /Users/gitlab/builds/f6f95b82/0/bob/bob.devtools/miniconda/conda-bld/bob.devto: bad interpreter: No such file or directory
Tests failed for bob.devtools-2.0.1b0-py36h661208a_5.tar.bz2 - moving package to /Users/gitlab/builds/f6f95b82/0/bob/bob.devtools/miniconda/conda-bld/broken
WARNING conda_build.build:tests_failed(2230): Tests failed for bob.devtools-2.0.1b0-py36h661208a_5.tar.bz2 - moving package to /Users/gitlab/builds/f6f95b82/0/bob/bob.devtools/miniconda/conda-bld/broken
TESTS FAILED: bob.devtools-2.0.1b0-py36h661208a_5.tar.bz2
ERROR: Job failed: exit status 1
failed
build_linux_37 Build
export SRC_DIR=/scratch/builds/bob/bob.devtools/miniconda/conda-bld/bob.devtools_1570613419888/test_tmp
import: 'bob.devtools'
import: 'bob.devtools'
+ bdt -h
/scratch/builds/bob/bob.devtools/miniconda/conda-bld/bob.devtools_1570613419888/test_tmp/run_test.sh: /scratch/builds/bob/bob.devtools/miniconda/conda-bld/bob.devtools_1570613419888/_test_env_placehold_placehold_placehold_placehold_placehold_placehold_placehold_placehold_placehold_placehold_placehold_placehold_placehold_placehold_placehold_placehold_pla/bin/bdt: /scratch/builds/bob/bob.devtools/miniconda/conda-bld/bob.devtools_157061341988: bad interpreter: No such file or directory
Tests failed for bob.devtools-2.0.1b0-py37h661208a_5.tar.bz2 - moving package to /scratch/builds/bob/bob.devtools/miniconda/conda-bld/broken
WARNING conda_build.build:tests_failed(2230): Tests failed for bob.devtools-2.0.1b0-py37h661208a_5.tar.bz2 - moving package to /scratch/builds/bob/bob.devtools/miniconda/conda-bld/broken
TESTS FAILED: bob.devtools-2.0.1b0-py37h661208a_5.tar.bz2
ERROR: Job failed: exit code 1
failed
build_linux_36 Build
export SRC_DIR=/scratch/builds/bob/bob.devtools/miniconda/conda-bld/bob.devtools_1570613349296/test_tmp
import: 'bob.devtools'
import: 'bob.devtools'
+ bdt -h
/scratch/builds/bob/bob.devtools/miniconda/conda-bld/bob.devtools_1570613349296/test_tmp/run_test.sh: /scratch/builds/bob/bob.devtools/miniconda/conda-bld/bob.devtools_1570613349296/_test_env_placehold_placehold_placehold_placehold_placehold_placehold_placehold_placehold_placehold_placehold_placehold_placehold_placehold_placehold_placehold_placehold_pla/bin/bdt: /scratch/builds/bob/bob.devtools/miniconda/conda-bld/bob.devtools_157061334929: bad interpreter: No such file or directory
Tests failed for bob.devtools-2.0.1b0-py36h661208a_5.tar.bz2 - moving package to /scratch/builds/bob/bob.devtools/miniconda/conda-bld/broken
WARNING conda_build.build:tests_failed(2230): Tests failed for bob.devtools-2.0.1b0-py36h661208a_5.tar.bz2 - moving package to /scratch/builds/bob/bob.devtools/miniconda/conda-bld/broken
TESTS FAILED: bob.devtools-2.0.1b0-py36h661208a_5.tar.bz2
ERROR: Job failed: exit code 1