Update requirements.txt - remove gridtk

12 jobs for patch-1 in 24 minutes (queued for 5 seconds)
Name Stage Failure
failed
test_linux_27 Test There is an unknown failure, please try again

----------------------------------------------------------------------
Ran 45 tests in 106.746s

FAILED (failures=1)
(11:08:02)
Error: Command Failed "/home/gitlab-runner/builds/0d638152/2/bob/bob.bio.base/build-prefix/bin/coverage run --source=bob.bio.base /home/gitlab-runner/builds/0d638152/2/bob/bob.bio.base/build-prefix/bin/nosetests -sv bob.bio.base"
Running after script...
$ ./_ci/after_test.sh
ERROR: Build failed: exit status 1
failed
test_macosx_27 Test There is an unknown failure, please try again

----------------------------------------------------------------------
Ran 45 tests in 171.539s

FAILED (failures=1)
(11:13:50)
Error: Command Failed "/Users/buildbot/work/gitlab-ci/f6f95b82/2/bob/bob.bio.base/build-prefix/bin/coverage run --source=bob.bio.base /Users/buildbot/work/gitlab-ci/f6f95b82/2/bob/bob.bio.base/build-prefix/bin/nosetests -sv bob.bio.base"
Running after script...
$ ./_ci/after_test.sh
ERROR: Build failed: exit status 1
failed
test_macosx_34 Test There is an unknown failure, please try again

----------------------------------------------------------------------
Ran 45 tests in 173.268s

FAILED (failures=1)
(11:18:15)
Error: Command Failed "/Users/buildbot/work/gitlab-ci/f6f95b82/0/bob/bob.bio.base/build-prefix/bin/coverage run --source=bob.bio.base /Users/buildbot/work/gitlab-ci/f6f95b82/0/bob/bob.bio.base/build-prefix/bin/nosetests -sv bob.bio.base"
Running after script...
$ ./_ci/after_test.sh
ERROR: Build failed: exit status 1
failed
test_macosx_35 Test There is an unknown failure, please try again

----------------------------------------------------------------------
Ran 45 tests in 185.670s

FAILED (failures=1)
(11:19:14)
Error: Command Failed "/Users/buildbot/work/gitlab-ci/f6f95b82/1/bob/bob.bio.base/build-prefix/bin/coverage run --source=bob.bio.base /Users/buildbot/work/gitlab-ci/f6f95b82/1/bob/bob.bio.base/build-prefix/bin/nosetests -sv bob.bio.base"
Running after script...
$ ./_ci/after_test.sh
ERROR: Build failed: exit status 1
failed
test_linux_35 Test There is an unknown failure, please try again

----------------------------------------------------------------------
Ran 45 tests in 110.794s

FAILED (failures=1)
(11:07:54)
Error: Command Failed "/home/gitlab-runner/builds/0d638152/0/bob/bob.bio.base/build-prefix/bin/coverage run --source=bob.bio.base /home/gitlab-runner/builds/0d638152/0/bob/bob.bio.base/build-prefix/bin/nosetests -sv bob.bio.base"
Running after script...
$ ./_ci/after_test.sh
ERROR: Build failed: exit status 1
failed
test_linux_34 Test There is an unknown failure, please try again

----------------------------------------------------------------------
Ran 45 tests in 113.254s

FAILED (failures=1)
(11:08:00)
Error: Command Failed "/home/gitlab-runner/builds/0d638152/1/bob/bob.bio.base/build-prefix/bin/coverage run --source=bob.bio.base /home/gitlab-runner/builds/0d638152/1/bob/bob.bio.base/build-prefix/bin/nosetests -sv bob.bio.base"
Running after script...
$ ./_ci/after_test.sh
ERROR: Build failed: exit status 1