Correct names for acquisition packages

6 jobs for acquisition_station_packages in 359 minutes and 6 seconds (queued for 4 seconds)
Status Job ID Name Coverage
  Build
failed #242353
docker
build_linux_37

05:59:06

62.0%
failed #242354
docker
build_linux_38

05:48:14

62.0%
passed #242355
intel macos
build_macos_intel_37

05:17:11

69.0%
passed #242356
intel macos
build_macos_intel_38

05:03:36

69.0%
 
  Cleanup
skipped #242357
docker
cleanup
skipped #242358
docker allowed to fail manual
manual_cleanup
 
Name Stage Failure
failed
build_linux_37 Build
Coverage HTML written to dir /scratch/builds/bob/nightlies/src/bob/bob/conda/../sphinx/coverage
Coverage XML written to file /scratch/builds/bob/nightlies/src/bob/bob/conda/../coverage.xml

=========================== short test summary info ============================
FAILED bio/face/test/test_baselines.py::test_afffe - AssertionError: assert F...
= 1 failed, 756 passed, 79 skipped, 1 deselected, 2 xfailed, 1453 warnings in 2860.95s (0:47:40) =
Tests failed for bob-9.0.1b0-py37h871b364_81.conda - moving package to /scratch/builds/bob/nightlies/miniconda/conda-bld/broken
TESTS FAILED: bob-9.0.1b0-py37h871b364_81.conda
Cleaning up file based variables
ERROR: Job failed: exit code 1
failed
build_linux_38 Build
Coverage HTML written to dir /scratch/builds/bob/nightlies/src/bob/bob/conda/../sphinx/coverage
Coverage XML written to file /scratch/builds/bob/nightlies/src/bob/bob/conda/../coverage.xml

=========================== short test summary info ============================
FAILED bio/face/test/test_baselines.py::test_afffe - AssertionError: assert F...
= 1 failed, 756 passed, 79 skipped, 1 deselected, 2 xfailed, 1463 warnings in 2813.26s (0:46:53) =
Tests failed for bob-9.0.1b0-py38h871b364_81.conda - moving package to /scratch/builds/bob/nightlies/miniconda/conda-bld/broken
TESTS FAILED: bob-9.0.1b0-py38h871b364_81.conda
Cleaning up file based variables
ERROR: Job failed: exit code 1