deprecate bob.learn.libsvm and bob.learn.mlp

6 jobs for master in 323 minutes and 42 seconds (queued for 3 seconds)
Status Job ID Name Coverage
  Build
failed #239747
docker
build_linux_37

05:23:42

64.0%
failed #239748
docker
build_linux_38

05:18:00

65.0%
passed #239749
intel macos
build_macos_intel_37

04:27:14

69.0%
passed #239750
intel macos
build_macos_intel_38

04:22:45

69.0%
 
  Cleanup
skipped #239751
docker
cleanup
skipped #239752
docker allowed to fail manual
manual_cleanup
 
Name Stage Failure
failed
build_linux_37 Build
=========================== short test summary info ============================
FAILED bio/face/test/test_baselines.py::test_iresnet34 - AssertionError: asse...
FAILED bio/face/test/test_baselines.py::test_iresnet50 - AssertionError: asse...
FAILED bio/face/test/test_baselines.py::test_iresnet100 - AssertionError: ass...
= 3 failed, 750 passed, 80 skipped, 1 deselected, 2 xfailed, 1449 warnings in 2762.28s (0:46:02) =
Tests failed for bob-9.0.1b0-py37h871b364_65.conda - moving package to /scratch/builds/bob/nightlies/miniconda/conda-bld/broken
TESTS FAILED: bob-9.0.1b0-py37h871b364_65.conda
Cleaning up file based variables
ERROR: Job failed: exit code 1
failed
build_linux_38 Build
=========================== short test summary info ============================
FAILED bio/face/test/test_baselines.py::test_iresnet34 - AssertionError: asse...
FAILED bio/face/test/test_baselines.py::test_iresnet50 - AssertionError: asse...
FAILED bio/face/test/test_baselines.py::test_iresnet100 - AssertionError: ass...
= 3 failed, 750 passed, 80 skipped, 1 deselected, 2 xfailed, 1459 warnings in 2694.78s (0:44:54) =
Tests failed for bob-9.0.1b0-py38h871b364_63.conda - moving package to /scratch/builds/bob/nightlies/miniconda/conda-bld/broken
TESTS FAILED: bob-9.0.1b0-py38h871b364_63.conda
Cleaning up file based variables
ERROR: Job failed: exit code 1