deprecate bob.learn.libsvm and bob.learn.mlp

6 jobs for master in 259 minutes and 51 seconds (queued for 1 second)
Status Job ID Name Coverage
  Build
passed #239498
docker
build_linux_37

04:19:51

64.0%
passed #239499
docker
build_linux_38

04:17:35

64.0%
failed #239500
intel macos
build_macos_intel_37

02:23:46

48.0%
failed #239501
intel macos
build_macos_intel_38

03:19:35

56.0%
 
  Cleanup
skipped #239502
docker
cleanup
skipped #239503
docker allowed to fail manual
manual_cleanup
 
Name Stage Failure
failed
build_macos_intel_38 Build
intersphinx inventory has moved: https://docs.sqlalchemy.org/en/latest/objects.inv -> https://docs.sqlalchemy.org/en/14/objects.inv

Warning, treated as error:
failed to reach any of the inventories with the following issues:
intersphinx inventory 'http://matplotlib.org/objects.inv' not fetchable due to <class 'requests.exceptions.ConnectionError'>: HTTPConnectionPool(host='matplotlib.org', port=80): Max retries exceeded with url: /objects.inv (Caused by NewConnectionError('<urllib3.connection.HTTPConnection object at 0x7fa9e0fc4190>: Failed to establish a new connection: [Errno 8] nodename nor servname provided, or not known'))
Tests failed for bob.pad.base-3.0.1b0-py38h737230c_62.conda - moving package to /Users/gitlab/builds/nrU4yQP1/1/bob/nightlies/miniconda/conda-bld/broken
TESTS FAILED: bob.pad.base-3.0.1b0-py38h737230c_62.conda
Cleaning up file based variables
ERROR: Job failed: exit status 1
failed
build_macos_intel_37 Build
TOTAL                        1488    771    48%
----------------------------------------------------------------------
Ran 11 tests in 23.385s

FAILED (SKIP=1, errors=1)
Tests failed for gridtk-1.8.3b0-py37h279ac75_79.conda - moving package to /Users/gitlab/builds/nrU4yQP1/0/bob/nightlies/miniconda/conda-bld/broken
TESTS FAILED: gridtk-1.8.3b0-py37h279ac75_79.conda
Cleaning up file based variables
ERROR: Job failed: exit status 1