Merge branch 'master' into acquisition_station_packages

Pull deprecate bob.learn.libsvm and bob.learn.mlp from master
15 jobs for acquisition_station_packages in 226 minutes and 14 seconds (queued for 6 seconds)
latest
Status Job ID Name Coverage
  Build
failed #237424
docker
build_linux_37

03:29:40

68.0%
failed #237421
docker
build_linux_38

03:27:23

69.0%
failed #237422
intel macos
build_macos_intel_37

03:46:14

61.0%
failed #237423
intel macos
build_macos_intel_38

03:44:46

61.0%
failed #233269
docker
build_linux_37

01:05:15

79.0%
failed #234339
docker
build_linux_37

01:18:28

96.0%
failed #235230
docker
build_linux_37

04:19:03

74.0%
failed #234340
docker
build_linux_38

01:18:02

96.0%
failed #233270
docker
build_linux_38

01:04:43

79.0%
failed #233271
intel macos
build_macos_intel_37

00:39:26

95.0%
failed #234341
intel macos
build_macos_intel_37

02:08:52

96.0%
failed #233272
intel macos
build_macos_intel_38

01:47:53

79.0%
failed #234342
intel macos
build_macos_intel_38

00:41:35

95.0%
 
  Cleanup
skipped #233273
docker
cleanup
skipped #233274
docker allowed to fail manual
manual_cleanup
 
Name Stage Failure
failed
build_macos_intel_37 Build
Coverage XML written to file /Users/gitlab/builds/nrU4yQP1/0/bob/nightlies/src/bob/bob.bio.face/conda/../coverage.xml

=========================== short test summary info ============================
FAILED test/test_databases.py::test_replaymobile - TypeError: object.__init__...
====== 1 failed, 39 passed, 24 skipped, 845 warnings in 255.41s (0:04:15) ======
Tests failed for bob.bio.face-5.0.1b0-py37h301c2a9_62.conda - moving package to /Users/gitlab/builds/nrU4yQP1/0/bob/nightlies/miniconda/conda-bld/broken
TESTS FAILED: bob.bio.face-5.0.1b0-py37h301c2a9_62.conda
Cleaning up file based variables
ERROR: Job failed: exit status 1
failed
build_macos_intel_38 Build
Coverage XML written to file /Users/gitlab/builds/nrU4yQP1/1/bob/nightlies/src/bob/bob.bio.face/conda/../coverage.xml

=========================== short test summary info ============================
FAILED test/test_databases.py::test_replaymobile - TypeError: object.__init__...
====== 1 failed, 39 passed, 24 skipped, 845 warnings in 256.12s (0:04:16) ======
Tests failed for bob.bio.face-5.0.1b0-py38h301c2a9_59.conda - moving package to /Users/gitlab/builds/nrU4yQP1/1/bob/nightlies/miniconda/conda-bld/broken
TESTS FAILED: bob.bio.face-5.0.1b0-py38h301c2a9_59.conda
Cleaning up file based variables
ERROR: Job failed: exit status 1
failed
build_linux_37 Build
Coverage XML written to file /scratch/builds/bob/nightlies/src/bob/bob.bio.face/conda/../coverage.xml

=========================== short test summary info ============================
FAILED test/test_databases.py::test_replaymobile - TypeError: object.__init__...
===== 1 failed, 49 passed, 14 skipped, 918 warnings in 1574.31s (0:26:14) ======
Tests failed for bob.bio.face-5.0.1b0-py37h083fc0b_66.conda - moving package to /scratch/builds/bob/nightlies/miniconda/conda-bld/broken
TESTS FAILED: bob.bio.face-5.0.1b0-py37h083fc0b_66.conda
Cleaning up file based variables
ERROR: Job failed: exit code 1
failed
build_linux_38 Build
Coverage XML written to file /scratch/builds/bob/nightlies/src/bob/bob.bio.face/conda/../coverage.xml

=========================== short test summary info ============================
FAILED test/test_databases.py::test_replaymobile - TypeError: object.__init__...
===== 1 failed, 49 passed, 14 skipped, 918 warnings in 1548.74s (0:25:48) ======
Tests failed for bob.bio.face-5.0.1b0-py38h083fc0b_63.conda - moving package to /scratch/builds/bob/nightlies/miniconda/conda-bld/broken
TESTS FAILED: bob.bio.face-5.0.1b0-py38h083fc0b_63.conda
Cleaning up file based variables
ERROR: Job failed: exit code 1