remove packages we don't want in nightlies and deprecated ones

7 jobs for master in 22 minutes and 29 seconds (queued for 1 second)
latest
Name Stage Failure
failed
build_macos_intel_39 Build
=========================== short test summary info ============================
ERROR tests/test_wrappers.py
ERROR tests/test_xarray.py
!!!!!!!!!!!!!!!!!!! Interrupted: 2 errors during collection !!!!!!!!!!!!!!!!!!!!
============================== 2 errors in 6.05s ===============================
Tests failed for bob.pipelines-2.0.1b0-py39h3466dce_18.conda - moving package to /Users/gitlab/builds/6eE8C-FW/1/bob/nightlies/miniconda/conda-bld/broken
TESTS FAILED: bob.pipelines-2.0.1b0-py39h3466dce_18.conda
Cleaning up project directory and file based variables
ERROR: Job failed: exit status 1

failed
build_macos_intel_38 Build
=========================== short test summary info ============================
ERROR tests/test_wrappers.py
ERROR tests/test_xarray.py
!!!!!!!!!!!!!!!!!!! Interrupted: 2 errors during collection !!!!!!!!!!!!!!!!!!!!
============================== 2 errors in 6.10s ===============================
Tests failed for bob.pipelines-2.0.1b0-py38h3466dce_18.conda - moving package to /Users/gitlab/builds/6eE8C-FW/0/bob/nightlies/miniconda/conda-bld/broken
TESTS FAILED: bob.pipelines-2.0.1b0-py38h3466dce_18.conda
Cleaning up project directory and file based variables
ERROR: Job failed: exit status 1

failed
build_linux_39 Build
=========================== short test summary info ============================
ERROR tests/test_wrappers.py
ERROR tests/test_xarray.py
!!!!!!!!!!!!!!!!!!! Interrupted: 2 errors during collection !!!!!!!!!!!!!!!!!!!!
============================== 2 errors in 5.20s ===============================
Tests failed for bob.pipelines-2.0.1b0-py39hbfafce2_18.conda - moving package to /scratch/builds/bob/nightlies/miniconda/conda-bld/broken
TESTS FAILED: bob.pipelines-2.0.1b0-py39hbfafce2_18.conda
Cleaning up project directory and file based variables
ERROR: Job failed: exit code 1

failed
build_linux_38 Build
=========================== short test summary info ============================
ERROR tests/test_wrappers.py
ERROR tests/test_xarray.py
!!!!!!!!!!!!!!!!!!! Interrupted: 2 errors during collection !!!!!!!!!!!!!!!!!!!!
============================== 2 errors in 4.89s ===============================
Tests failed for bob.pipelines-2.0.1b0-py38hbfafce2_18.conda - moving package to /scratch/builds/bob/nightlies/miniconda/conda-bld/broken
TESTS FAILED: bob.pipelines-2.0.1b0-py38hbfafce2_18.conda
Cleaning up project directory and file based variables
ERROR: Job failed: exit code 1

failed
build_macos_arm_39 Build
=========================== short test summary info ============================
ERROR tests/test_wrappers.py
ERROR tests/test_xarray.py
!!!!!!!!!!!!!!!!!!! Interrupted: 2 errors during collection !!!!!!!!!!!!!!!!!!!!
============================== 2 errors in 1.97s ===============================
Tests failed for bob.pipelines-2.0.1b0-py39h4ec703d_17.conda - moving package to /Users/gitlab/builds/sAZPGTqW/0/bob/nightlies/miniconda/conda-bld/broken
TESTS FAILED: bob.pipelines-2.0.1b0-py39h4ec703d_17.conda
Cleaning up project directory and file based variables
ERROR: Job failed: exit status 1