remove packages we don't want in nightlies and deprecated ones

7 jobs for master in 17 minutes and 41 seconds (queued for 4 seconds)
latest
Name Stage Failure
failed
build_macos_intel_39 Build
  File "/Users/gitlab/builds/6eE8C-FW/1/bob/nightlies/miniconda/conda-bld/bob.learn.em_1652541507193/_test_env_placehold_placehold_placehold_placehold_placehold_placehold_placehold_placehold_placehold_placehold_placehold_placehold_placehold_placehold_placehold_/lib/python3.9/site-packages/dask_ml/model_selection/__init__.py", line 8, in <module>
from ._search import GridSearchCV, RandomizedSearchCV, check_cv, compute_n_splits
File "/Users/gitlab/builds/6eE8C-FW/1/bob/nightlies/miniconda/conda-bld/bob.learn.em_1652541507193/_test_env_placehold_placehold_placehold_placehold_placehold_placehold_placehold_placehold_placehold_placehold_placehold_placehold_placehold_placehold_placehold_/lib/python3.9/site-packages/dask_ml/model_selection/_search.py", line 18, in <module>
from sklearn.base import (
ImportError: cannot import name '_is_pairwise' from 'sklearn.base' (/Users/gitlab/builds/6eE8C-FW/1/bob/nightlies/miniconda/conda-bld/bob.learn.em_1652541507193/_test_env_placehold_placehold_placehold_placehold_placehold_placehold_placehold_placehold_placehold_placehold_placehold_placehold_placehold_placehold_placehold_/lib/python3.9/site-packages/sklearn/base.py)
Tests failed for bob.learn.em-3.0.0b0-py39hd03b735_19.conda - moving package to /Users/gitlab/builds/6eE8C-FW/1/bob/nightlies/miniconda/conda-bld/broken
TESTS FAILED: bob.learn.em-3.0.0b0-py39hd03b735_19.conda
Cleaning up project directory and file based variables
ERROR: Job failed: exit status 1

failed
build_macos_intel_38 Build
  File "/Users/gitlab/builds/6eE8C-FW/0/bob/nightlies/miniconda/conda-bld/bob.learn.em_1652541505850/_test_env_placehold_placehold_placehold_placehold_placehold_placehold_placehold_placehold_placehold_placehold_placehold_placehold_placehold_placehold_placehold_/lib/python3.8/site-packages/dask_ml/model_selection/__init__.py", line 8, in <module>
from ._search import GridSearchCV, RandomizedSearchCV, check_cv, compute_n_splits
File "/Users/gitlab/builds/6eE8C-FW/0/bob/nightlies/miniconda/conda-bld/bob.learn.em_1652541505850/_test_env_placehold_placehold_placehold_placehold_placehold_placehold_placehold_placehold_placehold_placehold_placehold_placehold_placehold_placehold_placehold_/lib/python3.8/site-packages/dask_ml/model_selection/_search.py", line 18, in <module>
from sklearn.base import (
ImportError: cannot import name '_is_pairwise' from 'sklearn.base' (/Users/gitlab/builds/6eE8C-FW/0/bob/nightlies/miniconda/conda-bld/bob.learn.em_1652541505850/_test_env_placehold_placehold_placehold_placehold_placehold_placehold_placehold_placehold_placehold_placehold_placehold_placehold_placehold_placehold_placehold_/lib/python3.8/site-packages/sklearn/base.py)
Tests failed for bob.learn.em-3.0.0b0-py38hd03b735_19.conda - moving package to /Users/gitlab/builds/6eE8C-FW/0/bob/nightlies/miniconda/conda-bld/broken
TESTS FAILED: bob.learn.em-3.0.0b0-py38hd03b735_19.conda
Cleaning up project directory and file based variables
ERROR: Job failed: exit status 1

failed
build_linux_39 Build
  File "/scratch/builds/bob/nightlies/miniconda/conda-bld/bob.learn.em_1652541263710/_test_env_placehold_placehold_placehold_placehold_placehold_placehold_placehold_placehold_placehold_placehold_placehold_placehold_placehold_placehold_placehold_placehold_placeh/lib/python3.9/site-packages/dask_ml/model_selection/__init__.py", line 8, in <module>
from ._search import GridSearchCV, RandomizedSearchCV, check_cv, compute_n_splits
File "/scratch/builds/bob/nightlies/miniconda/conda-bld/bob.learn.em_1652541263710/_test_env_placehold_placehold_placehold_placehold_placehold_placehold_placehold_placehold_placehold_placehold_placehold_placehold_placehold_placehold_placehold_placehold_placeh/lib/python3.9/site-packages/dask_ml/model_selection/_search.py", line 18, in <module>
from sklearn.base import (
ImportError: cannot import name '_is_pairwise' from 'sklearn.base' (/scratch/builds/bob/nightlies/miniconda/conda-bld/bob.learn.em_1652541263710/_test_env_placehold_placehold_placehold_placehold_placehold_placehold_placehold_placehold_placehold_placehold_placehold_placehold_placehold_placehold_placehold_placehold_placeh/lib/python3.9/site-packages/sklearn/base.py)
Tests failed for bob.learn.em-3.0.0b0-py39h4769f04_19.conda - moving package to /scratch/builds/bob/nightlies/miniconda/conda-bld/broken
TESTS FAILED: bob.learn.em-3.0.0b0-py39h4769f04_19.conda
Cleaning up project directory and file based variables
ERROR: Job failed: exit code 1

failed
build_linux_38 Build
  File "/scratch/builds/bob/nightlies/miniconda/conda-bld/bob.learn.em_1652541259587/_test_env_placehold_placehold_placehold_placehold_placehold_placehold_placehold_placehold_placehold_placehold_placehold_placehold_placehold_placehold_placehold_placehold_placeh/lib/python3.8/site-packages/dask_ml/model_selection/__init__.py", line 8, in <module>
from ._search import GridSearchCV, RandomizedSearchCV, check_cv, compute_n_splits
File "/scratch/builds/bob/nightlies/miniconda/conda-bld/bob.learn.em_1652541259587/_test_env_placehold_placehold_placehold_placehold_placehold_placehold_placehold_placehold_placehold_placehold_placehold_placehold_placehold_placehold_placehold_placehold_placeh/lib/python3.8/site-packages/dask_ml/model_selection/_search.py", line 18, in <module>
from sklearn.base import (
ImportError: cannot import name '_is_pairwise' from 'sklearn.base' (/scratch/builds/bob/nightlies/miniconda/conda-bld/bob.learn.em_1652541259587/_test_env_placehold_placehold_placehold_placehold_placehold_placehold_placehold_placehold_placehold_placehold_placehold_placehold_placehold_placehold_placehold_placehold_placeh/lib/python3.8/site-packages/sklearn/base.py)
Tests failed for bob.learn.em-3.0.0b0-py38h4769f04_19.conda - moving package to /scratch/builds/bob/nightlies/miniconda/conda-bld/broken
TESTS FAILED: bob.learn.em-3.0.0b0-py38h4769f04_19.conda
Cleaning up project directory and file based variables
ERROR: Job failed: exit code 1

failed
build_macos_arm_39 Build
  File "/Users/gitlab/builds/sAZPGTqW/0/bob/nightlies/miniconda/conda-bld/bob.learn.em_1652540935240/_test_env_placehold_placehold_placehold_placehold_placehold_placehold_placehold_placehold_placehold_placehold_placehold_placehold_placehold_placehold_placehold_/lib/python3.9/site-packages/dask_ml/model_selection/__init__.py", line 8, in <module>
from ._search import GridSearchCV, RandomizedSearchCV, check_cv, compute_n_splits
File "/Users/gitlab/builds/sAZPGTqW/0/bob/nightlies/miniconda/conda-bld/bob.learn.em_1652540935240/_test_env_placehold_placehold_placehold_placehold_placehold_placehold_placehold_placehold_placehold_placehold_placehold_placehold_placehold_placehold_placehold_/lib/python3.9/site-packages/dask_ml/model_selection/_search.py", line 18, in <module>
from sklearn.base import (
ImportError: cannot import name '_is_pairwise' from 'sklearn.base' (/Users/gitlab/builds/sAZPGTqW/0/bob/nightlies/miniconda/conda-bld/bob.learn.em_1652540935240/_test_env_placehold_placehold_placehold_placehold_placehold_placehold_placehold_placehold_placehold_placehold_placehold_placehold_placehold_placehold_placehold_/lib/python3.9/site-packages/sklearn/base.py)
Tests failed for bob.learn.em-3.0.0b0-py39h949a54d_18.conda - moving package to /Users/gitlab/builds/sAZPGTqW/0/bob/nightlies/miniconda/conda-bld/broken
TESTS FAILED: bob.learn.em-3.0.0b0-py39h949a54d_18.conda
Cleaning up project directory and file based variables
ERROR: Job failed: exit status 1