Standardise

6 jobs for master in 4 minutes and 27 seconds (queued for 1 second)
Status Job ID Name Coverage
  Build
failed #6382
conda-linux
build_linux_27

00:00:16

failed #6383
conda-linux
build_linux_34

00:00:17

failed #6384
conda-linux
build_linux_35

00:00:18

failed #6385
conda-macosx
build_macosx_27

00:01:31

failed #6386
conda-macosx
build_macosx_34

00:01:11

failed #6387
conda-macosx
build_macosx_35

00:00:54

 
Name Stage Failure
failed
build_macosx_35 Build There is an unknown failure, please try again
  File "/Users/buildbot/work/gitlab-ci/work/gitlab-ci/f6f95b82/2/bob/gridtk/eggs/bob.buildout-2.0.13-py3.5.egg/bob/buildout/extension.py", line 213, in develop
zc.buildout.easy_install.call_subprocess(args)
File "/Users/buildbot/work/gitlab-ci/work/gitlab-ci/f6f95b82/2/bob/gridtk/eggs/zc.buildout-2.5.2-py3.5.egg/zc/buildout/easy_install.py", line 160, in call_subprocess
% repr(args)[1:-1])
Exception: Failed to run command:
'/Users/buildbot/work/gitlab-ci/work/gitlab-ci/f6f95b82/2/bob/gridtk/env/bin/python', '/var/folders/8n/phc2t7ln52l2srkgv49ybfj00001fc/T/tmpwoxociw5', '-v', 'develop', '-mxN', '-d', '/Users/buildbot/work/gitlab-ci/work/gitlab-ci/f6f95b82/2/bob/gridtk/develop-eggs/tmpzh4e0r13build'
Running after script...
$ rm -rf ${CONDA_PREFIX}
ERROR: Build failed: exit status 1
failed
build_macosx_34 Build There is an unknown failure, please try again
  File "/Users/buildbot/work/gitlab-ci/work/gitlab-ci/f6f95b82/1/bob/gridtk/eggs/bob.buildout-2.0.13-py3.4.egg/bob/buildout/extension.py", line 213, in develop
zc.buildout.easy_install.call_subprocess(args)
File "/Users/buildbot/work/gitlab-ci/work/gitlab-ci/f6f95b82/1/bob/gridtk/eggs/zc.buildout-2.5.2-py3.4.egg/zc/buildout/easy_install.py", line 160, in call_subprocess
% repr(args)[1:-1])
Exception: Failed to run command:
'/Users/buildbot/work/gitlab-ci/work/gitlab-ci/f6f95b82/1/bob/gridtk/env/bin/python', '/var/folders/8n/phc2t7ln52l2srkgv49ybfj00001fc/T/tmpq1tno4cg', '-v', 'develop', '-mxN', '-d', '/Users/buildbot/work/gitlab-ci/work/gitlab-ci/f6f95b82/1/bob/gridtk/develop-eggs/tmpnx5s526ibuild'
Running after script...
$ rm -rf ${CONDA_PREFIX}
ERROR: Build failed: exit status 1
failed
build_macosx_27 Build There is an unknown failure, please try again
  File "/Users/buildbot/work/gitlab-ci/work/gitlab-ci/f6f95b82/0/bob/gridtk/eggs/bob.buildout-2.0.13-py2.7.egg/bob/buildout/extension.py", line 213, in develop
zc.buildout.easy_install.call_subprocess(args)
File "/Users/buildbot/work/gitlab-ci/work/gitlab-ci/f6f95b82/0/bob/gridtk/eggs/zc.buildout-2.5.2-py2.7.egg/zc/buildout/easy_install.py", line 160, in call_subprocess
% repr(args)[1:-1])
Exception: Failed to run command:
'/Users/buildbot/work/gitlab-ci/work/gitlab-ci/f6f95b82/0/bob/gridtk/env/bin/python', '/var/folders/8n/phc2t7ln52l2srkgv49ybfj00001fc/T/tmp_R8mxF', '-v', 'develop', '-mxN', '-d', '/Users/buildbot/work/gitlab-ci/work/gitlab-ci/f6f95b82/0/bob/gridtk/develop-eggs/tmprwEZi2build'
Running after script...
$ rm -rf ${CONDA_PREFIX}
ERROR: Build failed: exit status 1
failed
build_linux_35 Build There is an unknown failure, please try again
  File "/local/gitlab-runner/builds/224a6381/0/bob/gridtk/eggs/bob.buildout-2.0.13-py3.5.egg/bob/buildout/extension.py", line 213, in develop
zc.buildout.easy_install.call_subprocess(args)
File "/local/gitlab-runner/builds/224a6381/0/bob/gridtk/eggs/zc.buildout-2.5.2-py3.5.egg/zc/buildout/easy_install.py", line 160, in call_subprocess
% repr(args)[1:-1])
Exception: Failed to run command:
'/local/gitlab-runner/builds/224a6381/0/bob/gridtk/env/bin/python', '/tmp/tmp_fk1dha1', '-v', 'develop', '-mxN', '-d', '/local/gitlab-runner/builds/224a6381/0/bob/gridtk/develop-eggs/tmpm59833nzbuild'
Running after script...
$ rm -rf ${CONDA_PREFIX}
ERROR: Build failed: exit status 1
failed
build_linux_34 Build There is an unknown failure, please try again
  File "/local/gitlab-runner/builds/6b02994f/0/bob/gridtk/eggs/bob.buildout-2.0.13-py3.4.egg/bob/buildout/extension.py", line 213, in develop
zc.buildout.easy_install.call_subprocess(args)
File "/local/gitlab-runner/builds/6b02994f/0/bob/gridtk/eggs/zc.buildout-2.5.2-py3.4.egg/zc/buildout/easy_install.py", line 160, in call_subprocess
% repr(args)[1:-1])
Exception: Failed to run command:
'/local/gitlab-runner/builds/6b02994f/0/bob/gridtk/env/bin/python', '/tmp/tmpo11j9g0c', '-v', 'develop', '-mxN', '-d', '/local/gitlab-runner/builds/6b02994f/0/bob/gridtk/develop-eggs/tmpenjvve71build'
Running after script...
$ rm -rf ${CONDA_PREFIX}
ERROR: Build failed: exit status 1
failed
build_linux_27 Build There is an unknown failure, please try again
  File "/local/gitlab-runner/builds/adaa8403/0/bob/gridtk/eggs/bob.buildout-2.0.13-py2.7.egg/bob/buildout/extension.py", line 213, in develop
zc.buildout.easy_install.call_subprocess(args)
File "/local/gitlab-runner/builds/adaa8403/0/bob/gridtk/eggs/zc.buildout-2.5.2-py2.7.egg/zc/buildout/easy_install.py", line 160, in call_subprocess
% repr(args)[1:-1])
Exception: Failed to run command:
'/local/gitlab-runner/builds/adaa8403/0/bob/gridtk/env/bin/python', '/tmp/tmpK1X7si', '-v', 'develop', '-mxN', '-d', '/local/gitlab-runner/builds/adaa8403/0/bob/gridtk/develop-eggs/tmpXqd2fzbuild'
Running after script...
$ rm -rf ${CONDA_PREFIX}
ERROR: Build failed: exit status 1