[setup] Fix requirement parsing

12 jobs for master in 11 minutes and 30 seconds (queued for 2 seconds)
Name Stage Failure
failed
test_linux_34 Test There is an unknown failure, please try again
Successfully installed gridtk-1.3.1b0
$ cd ${CONDA_PREFIX}
$ python -c "from ${CI_PROJECT_NAME} import get_config; print(get_config())"
Traceback (most recent call last):
File "<string>", line 1, in <module>
ImportError: cannot import name 'get_config'
Running after script...
$ rm -rf ${CONDA_PREFIX}
ERROR: Build failed: exit status 1
failed
test_macosx_27 Test There is an unknown failure, please try again
Successfully installed gridtk-1.3.1b0
$ cd ${CONDA_PREFIX}
$ python -c "from ${CI_PROJECT_NAME} import get_config; print(get_config())"
Traceback (most recent call last):
File "<string>", line 1, in <module>
ImportError: cannot import name get_config
Running after script...
$ rm -rf ${CONDA_PREFIX}
ERROR: Build failed: exit status 1
failed
test_macosx_35 Test There is an unknown failure, please try again
Successfully installed gridtk-1.3.1b0
$ cd ${CONDA_PREFIX}
$ python -c "from ${CI_PROJECT_NAME} import get_config; print(get_config())"
Traceback (most recent call last):
File "<string>", line 1, in <module>
ImportError: cannot import name 'get_config'
Running after script...
$ rm -rf ${CONDA_PREFIX}
ERROR: Build failed: exit status 1
failed
test_linux_27 Test There is an unknown failure, please try again
Successfully installed gridtk-1.3.1b0
$ cd ${CONDA_PREFIX}
$ python -c "from ${CI_PROJECT_NAME} import get_config; print(get_config())"
Traceback (most recent call last):
File "<string>", line 1, in <module>
ImportError: cannot import name get_config
Running after script...
$ rm -rf ${CONDA_PREFIX}
ERROR: Build failed: exit status 1
failed
test_linux_35 Test There is an unknown failure, please try again
Successfully installed gridtk-1.3.1b0
$ cd ${CONDA_PREFIX}
$ python -c "from ${CI_PROJECT_NAME} import get_config; print(get_config())"
Traceback (most recent call last):
File "<string>", line 1, in <module>
ImportError: cannot import name 'get_config'
Running after script...
$ rm -rf ${CONDA_PREFIX}
ERROR: Build failed: exit status 1
failed
test_macosx_34 Test There is an unknown failure, please try again
Successfully installed gridtk-1.3.1b0
$ cd ${CONDA_PREFIX}
$ python -c "from ${CI_PROJECT_NAME} import get_config; print(get_config())"
Traceback (most recent call last):
File "<string>", line 1, in <module>
ImportError: cannot import name 'get_config'
Running after script...
$ rm -rf ${CONDA_PREFIX}
ERROR: Build failed: exit status 1