libopencv package name

2 jobs for debug_opencv in 18 minutes and 27 seconds (queued for 1 second)
Status Job ID Name Coverage
  Build
failed #222019
docker
build_linux

00:12:13

failed #222020
intel macos
build_macos_intel

00:18:27

 
Name Stage Failure
failed
build_macos_intel Build
running run_test_opencv.py
Traceback (most recent call last):
File "/Users/gitlab/builds/nrU4yQP1/0/bob/conda/miniconda/conda-bld/libopencv_1611587908934/test_tmp/run_test.py", line 9, in <module>
import pkg_resources
ModuleNotFoundError: No module named 'pkg_resources'
Tests failed for opencv-4.5.0-py37_1.conda - moving package to /Users/gitlab/builds/nrU4yQP1/0/bob/conda/miniconda/conda-bld/broken
TESTS FAILED: opencv-4.5.0-py37_1.conda
Cleaning up file based variables
ERROR: Job failed: exit status 1
failed
build_linux Build
running run_test_opencv.py
Traceback (most recent call last):
File "/scratch/builds/bob/conda/miniconda/conda-bld/libopencv_1611587910617/test_tmp/run_test.py", line 9, in <module>
import pkg_resources
ModuleNotFoundError: No module named 'pkg_resources'
Tests failed for opencv-4.5.0-py37_1.conda - moving package to /scratch/builds/bob/conda/miniconda/conda-bld/broken
TESTS FAILED: opencv-4.5.0-py37_1.conda
Cleaning up file based variables
ERROR: Job failed: exit code 1