Apply integrity test to opencv package, not libopencv

2 jobs for debug_opencv in 13 minutes and 50 seconds (queued for 1 second)
Status Job ID Name Coverage
  Build
failed #222017
docker
build_linux

00:09:10

failed #222018
intel macos
build_macos_intel

00:13:43

 
Name Stage Failure
failed
build_macos_intel Build
Traceback (most recent call last):
File "/Users/gitlab/builds/nrU4yQP1/0/bob/conda/miniconda/conda-bld/opencv-suite_1611586048574/test_tmp/run_test.py", line 2, in <module>
import cv2
ModuleNotFoundError: No module named 'cv2'
import: 'cv2'
Tests failed for py-opencv-4.5.0-py37hcf68f36_1.conda - moving package to /Users/gitlab/builds/nrU4yQP1/0/bob/conda/miniconda/conda-bld/broken
TESTS FAILED: py-opencv-4.5.0-py37hcf68f36_1.conda
Cleaning up file based variables
ERROR: Job failed: exit status 1
failed
build_linux Build
import: 'cv2'
Traceback (most recent call last):
File "/scratch/builds/bob/conda/miniconda/conda-bld/opencv-suite_1611586028880/test_tmp/run_test.py", line 2, in <module>
import cv2
ModuleNotFoundError: No module named 'cv2'
Tests failed for py-opencv-4.5.0-py37h73dd053_1.conda - moving package to /scratch/builds/bob/conda/miniconda/conda-bld/broken
TESTS FAILED: py-opencv-4.5.0-py37h73dd053_1.conda
Cleaning up file based variables
ERROR: Job failed: exit code 1