Refactor function name

2 jobs for debug_opencv in 17 minutes and 21 seconds (queued for 8 seconds)
Status Job ID Name Coverage
  Build
failed #222015
docker
build_linux

00:11:32

failed #222016
intel macos
build_macos_intel

00:17:21

 
Name Stage Failure
failed
build_macos_intel Build
running run_test.py
Traceback (most recent call last):
File "/Users/gitlab/builds/nrU4yQP1/1/bob/conda/miniconda/conda-bld/libopencv_1611583060031/test_tmp/run_test.py", line 8, in <module>
import cv2
ModuleNotFoundError: No module named 'cv2'
Tests failed for libopencv-4.5.0-py37_1.conda - moving package to /Users/gitlab/builds/nrU4yQP1/1/bob/conda/miniconda/conda-bld/broken
TESTS FAILED: libopencv-4.5.0-py37_1.conda
Cleaning up file based variables
ERROR: Job failed: exit status 1
failed
build_linux Build
running run_test.py
Traceback (most recent call last):
File "/scratch/builds/bob/conda/miniconda/conda-bld/libopencv_1611583069987/test_tmp/run_test.py", line 8, in <module>
import cv2
ModuleNotFoundError: No module named 'cv2'
Tests failed for libopencv-4.5.0-py37_1.conda - moving package to /scratch/builds/bob/conda/miniconda/conda-bld/broken
TESTS FAILED: libopencv-4.5.0-py37_1.conda
Cleaning up file based variables
ERROR: Job failed: exit code 1