Move documentation of Bob to bob/docs

5 jobs for master in 165 minutes and 48 seconds (queued for 5 seconds)
Status Job ID Name Coverage
  Build
failed #187832
docker
build_linux_36

02:45:43

65.0%
failed #187833
docker
build_linux_37

02:43:43

65.0%
failed #187830
macosx
build_macosx_36

02:06:32

65.0%
failed #187831
macosx
build_macosx_37

02:04:47

65.0%
 
  Deploy
skipped #187834
docker
deploy_beta
 
Name Stage Failure
failed
build_linux_36 Build
reading sources... [100%] index


Warning, treated as error:
/scratch/builds/bob/bob/doc/index.rst:8:Unknown target name: "idiap".
Tests failed for bob-7.0.0b0-py36h56759fa_23.conda - moving package to /scratch/builds/bob/bob/miniconda/conda-bld/broken
WARNING:conda_build.build:Tests failed for bob-7.0.0b0-py36h56759fa_23.conda - moving package to /scratch/builds/bob/bob/miniconda/conda-bld/broken
TESTS FAILED: bob-7.0.0b0-py36h56759fa_23.conda
ERROR: Job failed: exit code 1
failed
build_linux_37 Build
reading sources... [100%] index


Warning, treated as error:
/scratch/builds/bob/bob/doc/index.rst:8:Unknown target name: "idiap".
Tests failed for bob-7.0.0b0-py37h56759fa_21.conda - moving package to /scratch/builds/bob/bob/miniconda/conda-bld/broken
WARNING:conda_build.build:Tests failed for bob-7.0.0b0-py37h56759fa_21.conda - moving package to /scratch/builds/bob/bob/miniconda/conda-bld/broken
TESTS FAILED: bob-7.0.0b0-py37h56759fa_21.conda
ERROR: Job failed: exit code 1
failed
build_macosx_36 Build
reading sources... [100%] index


Warning, treated as error:
/Users/gitlab/builds/b6d3167a/0/bob/bob/doc/index.rst:8:Unknown target name: "idiap".
Tests failed for bob-7.0.0b0-py36haafa87e_24.conda - moving package to /Users/gitlab/builds/b6d3167a/0/bob/bob/miniconda/conda-bld/broken
WARNING:conda_build.build:Tests failed for bob-7.0.0b0-py36haafa87e_24.conda - moving package to /Users/gitlab/builds/b6d3167a/0/bob/bob/miniconda/conda-bld/broken
TESTS FAILED: bob-7.0.0b0-py36haafa87e_24.conda
ERROR: Job failed: exit status 1
failed
build_macosx_37 Build
reading sources... [100%] index


Warning, treated as error:
/Users/gitlab/builds/b6d3167a/1/bob/bob/doc/index.rst:8:Unknown target name: "idiap".
Tests failed for bob-7.0.0b0-py37haafa87e_23.conda - moving package to /Users/gitlab/builds/b6d3167a/1/bob/bob/miniconda/conda-bld/broken
WARNING:conda_build.build:Tests failed for bob-7.0.0b0-py37haafa87e_23.conda - moving package to /Users/gitlab/builds/b6d3167a/1/bob/bob/miniconda/conda-bld/broken
TESTS FAILED: bob-7.0.0b0-py37haafa87e_23.conda
ERROR: Job failed: exit status 1