Testing bob.buildout wiht pytest. Added dask-ml as test dependency

3 jobs for master in 106 minutes and 22 seconds (queued for 3 seconds)
Name Stage Failure
failed
build_linux_37 Build
FAILED (SKIP=38, errors=41, failures=16)
Tests failed for bob-8.0.1b0-py37hdd5717b_0.conda - moving package to /scratch/builds/bob/bob/miniconda/conda-bld/broken
TESTS FAILED: bob-8.0.1b0-py37hdd5717b_0.conda
Uploading artifacts for failed job
Uploading artifacts...
WARNING: coverage.xml: no matching files
ERROR: No files to upload
Cleaning up file based variables
ERROR: Job failed: exit code 1
failed
build_macosx_37 Build
Tests failed for bob-8.0.1b0-py37hd3ba326_0.conda - moving package to /Users/gitlab/builds/b6d3167a/0/bob/bob/miniconda/conda-bld/broken
TESTS FAILED: bob-8.0.1b0-py37hd3ba326_0.conda
Uploading artifacts for failed job
Uploading artifacts...
Runtime platform
arch=amd64 os=darwin pid=45924 revision=8fa89735 version=13.6.0
WARNING: coverage.xml: no matching files
ERROR: No files to upload
Cleaning up file based variables
ERROR: Job failed: exit status 1