[conda recipe] Add make next to cmake dependency

5 jobs for master in 10 minutes and 59 seconds (queued for 10 seconds)
Status Job ID Name Coverage
  Build
failed #216731
docker
build_linux_36

00:04:27

failed #216732
docker
build_linux_37

00:04:25

failed #216729
macosx
build_macosx_36

00:06:41

failed #216730
macosx
build_macosx_37

00:06:40

 
  Deploy
skipped #216733
docker
deploy_beta
 
Name Stage Failure
failed
build_macosx_37 Build
WARNING conda_build.build:tests_failed(2896): Tests failed for bob.sp-2.0.17b0-py37ha6c1994_22.conda - moving package to /Users/gitlab/builds/b6d3167a/1/bob/bob.sp/miniconda/conda-bld/broken
TESTS FAILED: bob.sp-2.0.17b0-py37ha6c1994_22.conda
Uploading artifacts for failed job
Uploading artifacts...
Runtime platform
arch=amd64 os=darwin pid=95031 revision=ece86343 version=13.5.0
WARNING: coverage.xml: no matching files
ERROR: No files to upload
Cleaning up file based variables
ERROR: Job failed: exit status 1
failed
build_macosx_36 Build
WARNING conda_build.build:tests_failed(2896): Tests failed for bob.sp-2.0.17b0-py36ha6c1994_24.conda - moving package to /Users/gitlab/builds/b6d3167a/0/bob/bob.sp/miniconda/conda-bld/broken
TESTS FAILED: bob.sp-2.0.17b0-py36ha6c1994_24.conda
Uploading artifacts for failed job
Uploading artifacts...
Runtime platform
arch=amd64 os=darwin pid=94388 revision=ece86343 version=13.5.0
WARNING: coverage.xml: no matching files
ERROR: No files to upload
Cleaning up file based variables
ERROR: Job failed: exit status 1
failed
build_linux_36 Build
Tests failed for bob.sp-2.0.17b0-py36h81bd68d_24.conda - moving package to /scratch/builds/bob/bob.sp/miniconda/conda-bld/broken
WARNING conda_build.build:tests_failed(2896): Tests failed for bob.sp-2.0.17b0-py36h81bd68d_24.conda - moving package to /scratch/builds/bob/bob.sp/miniconda/conda-bld/broken
TESTS FAILED: bob.sp-2.0.17b0-py36h81bd68d_24.conda
Uploading artifacts for failed job
Uploading artifacts...
WARNING: coverage.xml: no matching files
ERROR: No files to upload
Cleaning up file based variables
ERROR: Job failed: exit code 1
failed
build_linux_37 Build
Tests failed for bob.sp-2.0.17b0-py37h81bd68d_25.conda - moving package to /scratch/builds/bob/bob.sp/miniconda/conda-bld/broken
WARNING conda_build.build:tests_failed(2896): Tests failed for bob.sp-2.0.17b0-py37h81bd68d_25.conda - moving package to /scratch/builds/bob/bob.sp/miniconda/conda-bld/broken
TESTS FAILED: bob.sp-2.0.17b0-py37h81bd68d_25.conda
Uploading artifacts for failed job
Uploading artifacts...
WARNING: coverage.xml: no matching files
ERROR: No files to upload
Cleaning up file based variables
ERROR: Job failed: exit code 1