SampleLoaders as transformers

2 jobs for sample_loader_as_transformer in 6 minutes and 43 seconds (queued for 3 seconds)
Status Job ID Name Coverage
  Build
failed #220097
docker
build_linux_37

00:03:11

failed #220096
macosx
build_macosx_37

00:06:43

 
Name Stage Failure
failed
build_macosx_37 Build
Tests failed for bob.pipelines-0.0.1b0-py37h503e795_15.conda - moving package to /Users/gitlab/builds/f6f95b82/0/bob/bob.pipelines/miniconda/conda-bld/broken
TESTS FAILED: bob.pipelines-0.0.1b0-py37h503e795_15.conda
Uploading artifacts for failed job
Uploading artifacts...
Runtime platform
arch=amd64 os=darwin pid=29355 revision=8fa89735 version=13.6.0
WARNING: coverage.xml: no matching files
ERROR: No files to upload
Cleaning up file based variables
ERROR: Job failed: exit status 1
failed
build_linux_37 Build
FAILED (errors=3)
Tests failed for bob.pipelines-0.0.1b0-py37h7226452_17.conda - moving package to /scratch/builds/bob/bob.pipelines/miniconda/conda-bld/broken
TESTS FAILED: bob.pipelines-0.0.1b0-py37h7226452_17.conda
Uploading artifacts for failed job
Uploading artifacts...
WARNING: coverage.xml: no matching files
ERROR: No files to upload
Cleaning up file based variables
ERROR: Job failed: exit code 1