Merge branch 'update2' into 'master'

Using the same path used in the file checking in the delayed sample

See merge request !17
5 jobs for master in 8 minutes and 6 seconds (queued for 5 seconds)
Status Job ID Name Coverage
  Build
failed #194105
docker
build_linux_36

00:02:46

failed #194106
docker
build_linux_37

00:02:42

failed #194103
macosx
build_macosx_36

00:08:06

failed #194104
macosx
build_macosx_37

00:08:06

 
  Deploy
skipped #194107
docker
deploy_beta
 
Name Stage Failure
failed
build_macosx_36 Build
Ran 2 tests in 0.004s

FAILED (errors=2)
Tests failed for bob.pipelines-0.0.1b0-py36h514b641_12.conda - moving package to /Users/gitlab/builds/f6f95b82/0/bob/bob.pipelines/miniconda/conda-bld/broken
WARNING:conda_build.build:Tests failed for bob.pipelines-0.0.1b0-py36h514b641_12.conda - moving package to /Users/gitlab/builds/f6f95b82/0/bob/bob.pipelines/miniconda/conda-bld/broken
TESTS FAILED: bob.pipelines-0.0.1b0-py36h514b641_12.conda
Running after_script
Uploading artifacts for failed job
ERROR: Job failed: exit status 1
failed
build_macosx_37 Build
Ran 2 tests in 0.003s

FAILED (errors=2)
Tests failed for bob.pipelines-0.0.1b0-py37h514b641_12.conda - moving package to /Users/gitlab/builds/f6f95b82/1/bob/bob.pipelines/miniconda/conda-bld/broken
WARNING:conda_build.build:Tests failed for bob.pipelines-0.0.1b0-py37h514b641_12.conda - moving package to /Users/gitlab/builds/f6f95b82/1/bob/bob.pipelines/miniconda/conda-bld/broken
TESTS FAILED: bob.pipelines-0.0.1b0-py37h514b641_12.conda
Running after_script
Uploading artifacts for failed job
ERROR: Job failed: exit status 1
failed
build_linux_36 Build
Ran 2 tests in 0.003s

FAILED (errors=2)
Tests failed for bob.pipelines-0.0.1b0-py36h514b641_12.conda - moving package to /scratch/builds/bob/bob.pipelines/miniconda/conda-bld/broken
WARNING:conda_build.build:Tests failed for bob.pipelines-0.0.1b0-py36h514b641_12.conda - moving package to /scratch/builds/bob/bob.pipelines/miniconda/conda-bld/broken
TESTS FAILED: bob.pipelines-0.0.1b0-py36h514b641_12.conda
Running after_script
Uploading artifacts for failed job
ERROR: Job failed: exit code 1
failed
build_linux_37 Build
Ran 2 tests in 0.003s

FAILED (errors=2)
Tests failed for bob.pipelines-0.0.1b0-py37h514b641_12.conda - moving package to /scratch/builds/bob/bob.pipelines/miniconda/conda-bld/broken
WARNING:conda_build.build:Tests failed for bob.pipelines-0.0.1b0-py37h514b641_12.conda - moving package to /scratch/builds/bob/bob.pipelines/miniconda/conda-bld/broken
TESTS FAILED: bob.pipelines-0.0.1b0-py37h514b641_12.conda
Running after_script
Uploading artifacts for failed job
ERROR: Job failed: exit code 1