If there's no samples, return an empty liss

4 jobs for update2 in 8 minutes and 8 seconds (queued for 1 second)
Status Job ID Name Coverage
  Build
failed #193603
docker
build_linux_36

00:02:48

failed #193604
docker
build_linux_37

00:02:47

failed #193601
macosx
build_macosx_36

00:08:08

failed #193602
macosx
build_macosx_37

00:08:08

 
Name Stage Failure
failed
build_macosx_37 Build
Ran 2 tests in 0.003s

FAILED (errors=2)
Tests failed for bob.pipelines-0.0.1b0-py37h514b641_12.conda - moving package to /Users/gitlab/builds/f6f95b82/1/bob/bob.pipelines/miniconda/conda-bld/broken
WARNING:conda_build.build:Tests failed for bob.pipelines-0.0.1b0-py37h514b641_12.conda - moving package to /Users/gitlab/builds/f6f95b82/1/bob/bob.pipelines/miniconda/conda-bld/broken
TESTS FAILED: bob.pipelines-0.0.1b0-py37h514b641_12.conda
Running after_script
Uploading artifacts for failed job
ERROR: Job failed: exit status 1
failed
build_macosx_36 Build
Ran 2 tests in 0.003s

FAILED (errors=2)
Tests failed for bob.pipelines-0.0.1b0-py36h514b641_12.conda - moving package to /Users/gitlab/builds/f6f95b82/0/bob/bob.pipelines/miniconda/conda-bld/broken
WARNING:conda_build.build:Tests failed for bob.pipelines-0.0.1b0-py36h514b641_12.conda - moving package to /Users/gitlab/builds/f6f95b82/0/bob/bob.pipelines/miniconda/conda-bld/broken
TESTS FAILED: bob.pipelines-0.0.1b0-py36h514b641_12.conda
Running after_script
Uploading artifacts for failed job
ERROR: Job failed: exit status 1
failed
build_linux_36 Build
Ran 2 tests in 0.003s

FAILED (errors=2)
Tests failed for bob.pipelines-0.0.1b0-py36h514b641_12.conda - moving package to /scratch/builds/bob/bob.pipelines/miniconda/conda-bld/broken
WARNING:conda_build.build:Tests failed for bob.pipelines-0.0.1b0-py36h514b641_12.conda - moving package to /scratch/builds/bob/bob.pipelines/miniconda/conda-bld/broken
TESTS FAILED: bob.pipelines-0.0.1b0-py36h514b641_12.conda
Running after_script
Uploading artifacts for failed job
ERROR: Job failed: exit code 1
failed
build_linux_37 Build
Ran 2 tests in 0.003s

FAILED (errors=2)
Tests failed for bob.pipelines-0.0.1b0-py37h514b641_12.conda - moving package to /scratch/builds/bob/bob.pipelines/miniconda/conda-bld/broken
WARNING:conda_build.build:Tests failed for bob.pipelines-0.0.1b0-py37h514b641_12.conda - moving package to /scratch/builds/bob/bob.pipelines/miniconda/conda-bld/broken
TESTS FAILED: bob.pipelines-0.0.1b0-py37h514b641_12.conda
Running after_script
Uploading artifacts for failed job
ERROR: Job failed: exit code 1