Make the load function accepts a path

4 jobs for update2 in 3 minutes and 4 seconds (queued for 5 seconds)
Status Job ID Name Coverage
  Build
failed #193304
docker
build_linux_36

00:02:43

failed #193305
docker
build_linux_37

00:02:39

failed #193302
macosx
build_macosx_36

00:03:04

failed #193303
macosx
build_macosx_37

00:03:02

 
Name Stage Failure
failed
build_macosx_36 Build
Ran 2 tests in 0.002s

FAILED (errors=2)
Tests failed for bob.pipelines-0.0.1b0-py36hdc9a386_12.conda - moving package to /Users/gitlab/builds/b6d3167a/0/bob/bob.pipelines/miniconda/conda-bld/broken
WARNING:conda_build.build:Tests failed for bob.pipelines-0.0.1b0-py36hdc9a386_12.conda - moving package to /Users/gitlab/builds/b6d3167a/0/bob/bob.pipelines/miniconda/conda-bld/broken
TESTS FAILED: bob.pipelines-0.0.1b0-py36hdc9a386_12.conda
Running after_script
Uploading artifacts for failed job
ERROR: Job failed: exit status 1
failed
build_macosx_37 Build
Ran 2 tests in 0.002s

FAILED (errors=2)
Tests failed for bob.pipelines-0.0.1b0-py37hdc9a386_12.conda - moving package to /Users/gitlab/builds/b6d3167a/1/bob/bob.pipelines/miniconda/conda-bld/broken
WARNING:conda_build.build:Tests failed for bob.pipelines-0.0.1b0-py37hdc9a386_12.conda - moving package to /Users/gitlab/builds/b6d3167a/1/bob/bob.pipelines/miniconda/conda-bld/broken
TESTS FAILED: bob.pipelines-0.0.1b0-py37hdc9a386_12.conda
Running after_script
Uploading artifacts for failed job
ERROR: Job failed: exit status 1
failed
build_linux_36 Build
Ran 2 tests in 0.003s

FAILED (errors=2)
Tests failed for bob.pipelines-0.0.1b0-py36hdc9a386_12.conda - moving package to /scratch/builds/bob/bob.pipelines/miniconda/conda-bld/broken
WARNING:conda_build.build:Tests failed for bob.pipelines-0.0.1b0-py36hdc9a386_12.conda - moving package to /scratch/builds/bob/bob.pipelines/miniconda/conda-bld/broken
TESTS FAILED: bob.pipelines-0.0.1b0-py36hdc9a386_12.conda
Running after_script
Uploading artifacts for failed job
ERROR: Job failed: exit code 1
failed
build_linux_37 Build
Ran 2 tests in 0.003s

FAILED (errors=2)
Tests failed for bob.pipelines-0.0.1b0-py37hdc9a386_12.conda - moving package to /scratch/builds/bob/bob.pipelines/miniconda/conda-bld/broken
WARNING:conda_build.build:Tests failed for bob.pipelines-0.0.1b0-py37hdc9a386_12.conda - moving package to /scratch/builds/bob/bob.pipelines/miniconda/conda-bld/broken
TESTS FAILED: bob.pipelines-0.0.1b0-py37hdc9a386_12.conda
Running after_script
Uploading artifacts for failed job
ERROR: Job failed: exit code 1