Fix dask_it, mix_me_up, and CheckpointMixin.load

4 jobs for updates in 8 minutes and 48 seconds (queued for 7 seconds)
Status Job ID Name Coverage
  Build
failed #193182
docker
build_linux_36

00:03:15

failed #193183
docker
build_linux_37

00:03:13

failed #193180
macosx
build_macosx_36

00:04:33

failed #193181
macosx
build_macosx_37

00:08:47

 
Name Stage Failure
failed
build_macosx_37 Build
Ran 10 tests in 3.259s

FAILED (errors=7)
Tests failed for bob.pipelines-0.0.1b0-py37h6394491_12.conda - moving package to /Users/gitlab/builds/f6f95b82/0/bob/bob.pipelines/miniconda/conda-bld/broken
WARNING:conda_build.build:Tests failed for bob.pipelines-0.0.1b0-py37h6394491_12.conda - moving package to /Users/gitlab/builds/f6f95b82/0/bob/bob.pipelines/miniconda/conda-bld/broken
TESTS FAILED: bob.pipelines-0.0.1b0-py37h6394491_12.conda
Running after_script
Uploading artifacts for failed job
ERROR: Job failed: exit status 1
failed
build_macosx_36 Build
Ran 10 tests in 2.128s

FAILED (errors=7)
Tests failed for bob.pipelines-0.0.1b0-py36h6394491_12.conda - moving package to /Users/gitlab/builds/b6d3167a/4/bob/bob.pipelines/miniconda/conda-bld/broken
WARNING:conda_build.build:Tests failed for bob.pipelines-0.0.1b0-py36h6394491_12.conda - moving package to /Users/gitlab/builds/b6d3167a/4/bob/bob.pipelines/miniconda/conda-bld/broken
TESTS FAILED: bob.pipelines-0.0.1b0-py36h6394491_12.conda
Running after_script
Uploading artifacts for failed job
ERROR: Job failed: exit status 1
failed
build_linux_36 Build
Ran 10 tests in 1.694s

FAILED (errors=7)
Tests failed for bob.pipelines-0.0.1b0-py36h6394491_12.conda - moving package to /scratch/builds/bob/bob.pipelines/miniconda/conda-bld/broken
WARNING:conda_build.build:Tests failed for bob.pipelines-0.0.1b0-py36h6394491_12.conda - moving package to /scratch/builds/bob/bob.pipelines/miniconda/conda-bld/broken
TESTS FAILED: bob.pipelines-0.0.1b0-py36h6394491_12.conda
Running after_script
Uploading artifacts for failed job
ERROR: Job failed: exit code 1
failed
build_linux_37 Build
Ran 10 tests in 1.549s

FAILED (errors=7)
Tests failed for bob.pipelines-0.0.1b0-py37h6394491_12.conda - moving package to /scratch/builds/bob/bob.pipelines/miniconda/conda-bld/broken
WARNING:conda_build.build:Tests failed for bob.pipelines-0.0.1b0-py37h6394491_12.conda - moving package to /scratch/builds/bob/bob.pipelines/miniconda/conda-bld/broken
TESTS FAILED: bob.pipelines-0.0.1b0-py37h6394491_12.conda
Running after_script
Uploading artifacts for failed job
ERROR: Job failed: exit code 1