SampleMixin don't call fit on stateless estimators

4 jobs for samplemixin-extra-args in 5 minutes and 28 seconds (queued for 2 seconds)
Status Job ID Name Coverage
  Build
failed #193076
docker
build_linux_36

00:03:11

failed #193077
docker
build_linux_37

00:03:04

failed #193074
macosx
build_macosx_36

00:05:21

failed #193075
macosx
build_macosx_37

00:05:15

 
Name Stage Failure
failed
build_macosx_36 Build
Ran 10 tests in 2.053s

FAILED (errors=5)
Tests failed for bob.pipelines-0.0.1b0-py36h6394491_12.conda - moving package to /Users/gitlab/builds/b6d3167a/0/bob/bob.pipelines/miniconda/conda-bld/broken
WARNING:conda_build.build:Tests failed for bob.pipelines-0.0.1b0-py36h6394491_12.conda - moving package to /Users/gitlab/builds/b6d3167a/0/bob/bob.pipelines/miniconda/conda-bld/broken
TESTS FAILED: bob.pipelines-0.0.1b0-py36h6394491_12.conda
Running after_script
Uploading artifacts for failed job
ERROR: Job failed: exit status 1
failed
build_macosx_37 Build
Ran 10 tests in 1.879s

FAILED (errors=5)
Tests failed for bob.pipelines-0.0.1b0-py37h6394491_12.conda - moving package to /Users/gitlab/builds/b6d3167a/1/bob/bob.pipelines/miniconda/conda-bld/broken
WARNING:conda_build.build:Tests failed for bob.pipelines-0.0.1b0-py37h6394491_12.conda - moving package to /Users/gitlab/builds/b6d3167a/1/bob/bob.pipelines/miniconda/conda-bld/broken
TESTS FAILED: bob.pipelines-0.0.1b0-py37h6394491_12.conda
Running after_script
Uploading artifacts for failed job
ERROR: Job failed: exit status 1
failed
build_linux_36 Build
Ran 10 tests in 1.943s

FAILED (errors=5)
Tests failed for bob.pipelines-0.0.1b0-py36h6394491_12.conda - moving package to /scratch/builds/bob/bob.pipelines/miniconda/conda-bld/broken
WARNING:conda_build.build:Tests failed for bob.pipelines-0.0.1b0-py36h6394491_12.conda - moving package to /scratch/builds/bob/bob.pipelines/miniconda/conda-bld/broken
TESTS FAILED: bob.pipelines-0.0.1b0-py36h6394491_12.conda
Running after_script
Uploading artifacts for failed job
ERROR: Job failed: exit code 1
failed
build_linux_37 Build
Ran 10 tests in 1.731s

FAILED (errors=5)
Tests failed for bob.pipelines-0.0.1b0-py37h6394491_12.conda - moving package to /scratch/builds/bob/bob.pipelines/miniconda/conda-bld/broken
WARNING:conda_build.build:Tests failed for bob.pipelines-0.0.1b0-py37h6394491_12.conda - moving package to /scratch/builds/bob/bob.pipelines/miniconda/conda-bld/broken
TESTS FAILED: bob.pipelines-0.0.1b0-py37h6394491_12.conda
Running after_script
Uploading artifacts for failed job
ERROR: Job failed: exit code 1