Making Linearized a transformer without FIT

4 jobs for linearize-fit in 4 minutes and 7 seconds (queued for 3 seconds)
Status Job ID Name Coverage
  Build
failed #193052
docker
build_linux_36

00:03:11

failed #193053
docker
build_linux_37

00:03:06

failed #193050
macosx
build_macosx_36

00:04:07

failed #193051
macosx
build_macosx_37

00:03:32

 
Name Stage Failure
failed
build_macosx_36 Build
Ran 10 tests in 1.989s

FAILED (errors=1)
Tests failed for bob.pipelines-0.0.1b0-py36h6394491_12.conda - moving package to /Users/gitlab/builds/b6d3167a/0/bob/bob.pipelines/miniconda/conda-bld/broken
WARNING:conda_build.build:Tests failed for bob.pipelines-0.0.1b0-py36h6394491_12.conda - moving package to /Users/gitlab/builds/b6d3167a/0/bob/bob.pipelines/miniconda/conda-bld/broken
TESTS FAILED: bob.pipelines-0.0.1b0-py36h6394491_12.conda
Running after_script
Uploading artifacts for failed job
ERROR: Job failed: exit status 1
failed
build_macosx_37 Build
Ran 10 tests in 2.169s

FAILED (errors=1)
Tests failed for bob.pipelines-0.0.1b0-py37h6394491_12.conda - moving package to /Users/gitlab/builds/b6d3167a/1/bob/bob.pipelines/miniconda/conda-bld/broken
WARNING:conda_build.build:Tests failed for bob.pipelines-0.0.1b0-py37h6394491_12.conda - moving package to /Users/gitlab/builds/b6d3167a/1/bob/bob.pipelines/miniconda/conda-bld/broken
TESTS FAILED: bob.pipelines-0.0.1b0-py37h6394491_12.conda
Running after_script
Uploading artifacts for failed job
ERROR: Job failed: exit status 1
failed
build_linux_36 Build
Ran 10 tests in 2.093s

FAILED (errors=1)
Tests failed for bob.pipelines-0.0.1b0-py36h6394491_12.conda - moving package to /scratch/builds/bob/bob.pipelines/miniconda/conda-bld/broken
WARNING:conda_build.build:Tests failed for bob.pipelines-0.0.1b0-py36h6394491_12.conda - moving package to /scratch/builds/bob/bob.pipelines/miniconda/conda-bld/broken
TESTS FAILED: bob.pipelines-0.0.1b0-py36h6394491_12.conda
Running after_script
Uploading artifacts for failed job
ERROR: Job failed: exit code 1
failed
build_linux_37 Build
Ran 10 tests in 1.938s

FAILED (errors=1)
Tests failed for bob.pipelines-0.0.1b0-py37h6394491_12.conda - moving package to /scratch/builds/bob/bob.pipelines/miniconda/conda-bld/broken
WARNING:conda_build.build:Tests failed for bob.pipelines-0.0.1b0-py37h6394491_12.conda - moving package to /scratch/builds/bob/bob.pipelines/miniconda/conda-bld/broken
TESTS FAILED: bob.pipelines-0.0.1b0-py37h6394491_12.conda
Running after_script
Uploading artifacts for failed job
ERROR: Job failed: exit code 1