Handling tasks with in heterogeneous workers

4 jobs for heterogenous_queue in 9 minutes and 9 seconds (queued for 2 seconds)
Status Job ID Name Coverage
  Build
failed #187171
docker
build_linux_36

00:03:17

failed #187172
docker
build_linux_37

00:03:08

failed #187169
macosx
build_macosx_36

00:09:09

failed #187170
macosx
build_macosx_37

00:09:04

 
Name Stage Failure
failed
build_macosx_36 Build
    needed = self.resolve(parse_requirements(requirements))
File "/Users/gitlab/builds/f6f95b82/0/bob/bob.pipelines/miniconda/conda-bld/bob.pipelines_1581351401125/_test_env_placehold_placehold_placehold_placehold_placehold_placehold_placehold_placehold_placehold_placehold_placehold_placehold_placehold_placehold_place/lib/python3.6/site-packages/pkg_resources/__init__.py", line 786, in resolve
raise DistributionNotFound(req, requirers)
pkg_resources.DistributionNotFound: The 'dask-jobqueue' distribution was not found and is required by bob.pipelines

Tests failed for bob.pipelines-0.0.1b0-py36h3537977_3.conda - moving package to /Users/gitlab/builds/f6f95b82/0/bob/bob.pipelines/miniconda/conda-bld/broken
WARNING:conda_build.build:Tests failed for bob.pipelines-0.0.1b0-py36h3537977_3.conda - moving package to /Users/gitlab/builds/f6f95b82/0/bob/bob.pipelines/miniconda/conda-bld/broken
TESTS FAILED: bob.pipelines-0.0.1b0-py36h3537977_3.conda
ERROR: Job failed: exit status 1
failed
build_macosx_37 Build
    needed = self.resolve(parse_requirements(requirements))
File "/Users/gitlab/builds/f6f95b82/1/bob/bob.pipelines/miniconda/conda-bld/bob.pipelines_1581351393570/_test_env_placehold_placehold_placehold_placehold_placehold_placehold_placehold_placehold_placehold_placehold_placehold_placehold_placehold_placehold_place/lib/python3.7/site-packages/pkg_resources/__init__.py", line 786, in resolve
raise DistributionNotFound(req, requirers)
pkg_resources.DistributionNotFound: The 'dask-jobqueue' distribution was not found and is required by bob.pipelines

Tests failed for bob.pipelines-0.0.1b0-py37h3537977_3.conda - moving package to /Users/gitlab/builds/f6f95b82/1/bob/bob.pipelines/miniconda/conda-bld/broken
WARNING:conda_build.build:Tests failed for bob.pipelines-0.0.1b0-py37h3537977_3.conda - moving package to /Users/gitlab/builds/f6f95b82/1/bob/bob.pipelines/miniconda/conda-bld/broken
TESTS FAILED: bob.pipelines-0.0.1b0-py37h3537977_3.conda
ERROR: Job failed: exit status 1
failed
build_linux_36 Build
    needed = self.resolve(parse_requirements(requirements))
File "/scratch/builds/bob/bob.pipelines/miniconda/conda-bld/bob.pipelines_1581351295635/_test_env_placehold_placehold_placehold_placehold_placehold_placehold_placehold_placehold_placehold_placehold_placehold_placehold_placehold_placehold_placehold_placehold_p/lib/python3.6/site-packages/pkg_resources/__init__.py", line 786, in resolve
raise DistributionNotFound(req, requirers)
pkg_resources.DistributionNotFound: The 'dask-jobqueue' distribution was not found and is required by bob.pipelines

Tests failed for bob.pipelines-0.0.1b0-py36h3537977_3.conda - moving package to /scratch/builds/bob/bob.pipelines/miniconda/conda-bld/broken
WARNING:conda_build.build:Tests failed for bob.pipelines-0.0.1b0-py36h3537977_3.conda - moving package to /scratch/builds/bob/bob.pipelines/miniconda/conda-bld/broken
TESTS FAILED: bob.pipelines-0.0.1b0-py36h3537977_3.conda
ERROR: Job failed: exit code 1
failed
build_linux_37 Build
    needed = self.resolve(parse_requirements(requirements))
File "/scratch/builds/bob/bob.pipelines/miniconda/conda-bld/bob.pipelines_1581351289559/_test_env_placehold_placehold_placehold_placehold_placehold_placehold_placehold_placehold_placehold_placehold_placehold_placehold_placehold_placehold_placehold_placehold_p/lib/python3.7/site-packages/pkg_resources/__init__.py", line 786, in resolve
raise DistributionNotFound(req, requirers)
pkg_resources.DistributionNotFound: The 'dask-jobqueue' distribution was not found and is required by bob.pipelines

Tests failed for bob.pipelines-0.0.1b0-py37h3537977_3.conda - moving package to /scratch/builds/bob/bob.pipelines/miniconda/conda-bld/broken
WARNING:conda_build.build:Tests failed for bob.pipelines-0.0.1b0-py37h3537977_3.conda - moving package to /scratch/builds/bob/bob.pipelines/miniconda/conda-bld/broken
TESTS FAILED: bob.pipelines-0.0.1b0-py37h3537977_3.conda
ERROR: Job failed: exit code 1