requires_fit is not all available all the time

4 jobs for updates in 3 minutes and 32 seconds (queued for 7 seconds)
Status Name Job ID Coverage
  Build
failed build_linux_36 #193120
docker

00:03:05

failed build_linux_37 #193121
docker

00:02:56

failed build_macosx_36 #193118
macosx

00:03:30

failed build_macosx_37 #193119
macosx

00:03:26

 
Name Stage Failure
failed
build_linux_37 Build
Ran 10 tests in 1.651s

FAILED (errors=9)
Tests failed for bob.pipelines-0.0.1b0-py37h6394491_12.conda - moving package to /scratch/builds/bob/bob.pipelines/miniconda/conda-bld/broken
WARNING:conda_build.build:Tests failed for bob.pipelines-0.0.1b0-py37h6394491_12.conda - moving package to /scratch/builds/bob/bob.pipelines/miniconda/conda-bld/broken
TESTS FAILED: bob.pipelines-0.0.1b0-py37h6394491_12.conda
Running after_script
Uploading artifacts for failed job
ERROR: Job failed: exit code 1
failed
build_macosx_37 Build
Ran 10 tests in 1.354s

FAILED (errors=9)
Tests failed for bob.pipelines-0.0.1b0-py37h6394491_12.conda - moving package to /Users/gitlab/builds/b6d3167a/1/bob/bob.pipelines/miniconda/conda-bld/broken
WARNING:conda_build.build:Tests failed for bob.pipelines-0.0.1b0-py37h6394491_12.conda - moving package to /Users/gitlab/builds/b6d3167a/1/bob/bob.pipelines/miniconda/conda-bld/broken
TESTS FAILED: bob.pipelines-0.0.1b0-py37h6394491_12.conda
Running after_script
Uploading artifacts for failed job
ERROR: Job failed: exit status 1
failed
build_linux_36 Build
Ran 10 tests in 1.702s

FAILED (errors=9)
Tests failed for bob.pipelines-0.0.1b0-py36h6394491_12.conda - moving package to /scratch/builds/bob/bob.pipelines/miniconda/conda-bld/broken
WARNING:conda_build.build:Tests failed for bob.pipelines-0.0.1b0-py36h6394491_12.conda - moving package to /scratch/builds/bob/bob.pipelines/miniconda/conda-bld/broken
TESTS FAILED: bob.pipelines-0.0.1b0-py36h6394491_12.conda
Running after_script
Uploading artifacts for failed job
ERROR: Job failed: exit code 1
failed
build_macosx_36 Build
Ran 10 tests in 1.590s

FAILED (errors=9)
Tests failed for bob.pipelines-0.0.1b0-py36h6394491_12.conda - moving package to /Users/gitlab/builds/b6d3167a/0/bob/bob.pipelines/miniconda/conda-bld/broken
WARNING:conda_build.build:Tests failed for bob.pipelines-0.0.1b0-py36h6394491_12.conda - moving package to /Users/gitlab/builds/b6d3167a/0/bob/bob.pipelines/miniconda/conda-bld/broken
TESTS FAILED: bob.pipelines-0.0.1b0-py36h6394491_12.conda
Running after_script
Uploading artifacts for failed job
ERROR: Job failed: exit status 1