Increased latest version to 1.0.11b0 [skip ci]

5 jobs for master in 7 minutes and 27 seconds (queued for 4 seconds)
latest
Status Job ID Name Coverage
  Build
failed #212890
docker
build_linux_36

00:04:12

failed #212891
docker
build_linux_37

00:04:07

failed #212888
macosx
build_macosx_36

00:03:09

failed #212889
macosx
build_macosx_37

00:07:24

 
  Deploy
skipped #212892
docker
deploy_beta
 
Name Stage Failure
failed
build_macosx_37 Build
WARNING conda_build.build:tests_failed(2890): Tests failed for bob.pad.voice-1.0.11b0-py37h0442177_5.conda - moving package to /Users/gitlab/builds/f6f95b82/0/bob/bob.pad.voice/miniconda/conda-bld/broken
TESTS FAILED: bob.pad.voice-1.0.11b0-py37h0442177_5.conda
Uploading artifacts for failed job
Uploading artifacts...
Runtime platform
arch=amd64 os=darwin pid=84254 revision=e95f89a0 version=13.4.1
WARNING: coverage.xml: no matching files
ERROR: No files to upload
Cleaning up file based variables
ERROR: Job failed: exit status 1
failed
build_linux_36 Build
Tests failed for bob.pad.voice-1.0.11b0-py36h0442177_5.conda - moving package to /scratch/builds/bob/bob.pad.voice/miniconda/conda-bld/broken
WARNING conda_build.build:tests_failed(2890): Tests failed for bob.pad.voice-1.0.11b0-py36h0442177_5.conda - moving package to /scratch/builds/bob/bob.pad.voice/miniconda/conda-bld/broken
TESTS FAILED: bob.pad.voice-1.0.11b0-py36h0442177_5.conda
Uploading artifacts for failed job
Uploading artifacts...
WARNING: coverage.xml: no matching files
ERROR: No files to upload
Cleaning up file based variables
ERROR: Job failed: exit code 1
failed
build_linux_37 Build
Tests failed for bob.pad.voice-1.0.11b0-py37h0442177_5.conda - moving package to /scratch/builds/bob/bob.pad.voice/miniconda/conda-bld/broken
WARNING conda_build.build:tests_failed(2890): Tests failed for bob.pad.voice-1.0.11b0-py37h0442177_5.conda - moving package to /scratch/builds/bob/bob.pad.voice/miniconda/conda-bld/broken
TESTS FAILED: bob.pad.voice-1.0.11b0-py37h0442177_5.conda
Uploading artifacts for failed job
Uploading artifacts...
WARNING: coverage.xml: no matching files
ERROR: No files to upload
Cleaning up file based variables
ERROR: Job failed: exit code 1
failed
build_macosx_36 Build
WARNING conda_build.build:tests_failed(2890): Tests failed for bob.pad.voice-1.0.11b0-py36h0442177_5.conda - moving package to /Users/gitlab/builds/b6d3167a/0/bob/bob.pad.voice/miniconda/conda-bld/broken
TESTS FAILED: bob.pad.voice-1.0.11b0-py36h0442177_5.conda
Uploading artifacts for failed job
Uploading artifacts...
Runtime platform
arch=amd64 os=darwin pid=89677 revision=e95f89a0 version=13.4.1
WARNING: coverage.xml: no matching files
ERROR: No files to upload
Cleaning up file based variables
ERROR: Job failed: exit status 1