Rewired bob.bio.base and bob.bio.spear to bob.bio.base_legacy and...

Rewired bob.bio.base and bob.bio.spear to bob.bio.base_legacy and bob.bio.spear_legacy respectivelly. THIS IS TEMPORARY
4 jobs for merge-bob.bio in 4 minutes and 22 seconds (queued for 5 seconds)
Status Name Job ID Coverage
  Build
failed build_linux_36 #212908
docker

00:04:19

failed build_linux_37 #212909
docker

00:04:12

failed build_macosx_36 #212906
macosx

00:04:05

failed build_macosx_37 #212907
macosx

00:03:39

 
Name Stage Failure
failed
build_linux_37 Build
Tests failed for bob.pad.voice-1.0.11b0-py37h0442177_5.conda - moving package to /scratch/builds/bob/bob.pad.voice/miniconda/conda-bld/broken
WARNING conda_build.build:tests_failed(2890): Tests failed for bob.pad.voice-1.0.11b0-py37h0442177_5.conda - moving package to /scratch/builds/bob/bob.pad.voice/miniconda/conda-bld/broken
TESTS FAILED: bob.pad.voice-1.0.11b0-py37h0442177_5.conda
Uploading artifacts for failed job
Uploading artifacts...
WARNING: coverage.xml: no matching files
ERROR: No files to upload
Cleaning up file based variables
ERROR: Job failed: exit code 1
failed
build_linux_36 Build
Tests failed for bob.pad.voice-1.0.11b0-py36h0442177_5.conda - moving package to /scratch/builds/bob/bob.pad.voice/miniconda/conda-bld/broken
WARNING conda_build.build:tests_failed(2890): Tests failed for bob.pad.voice-1.0.11b0-py36h0442177_5.conda - moving package to /scratch/builds/bob/bob.pad.voice/miniconda/conda-bld/broken
TESTS FAILED: bob.pad.voice-1.0.11b0-py36h0442177_5.conda
Uploading artifacts for failed job
Uploading artifacts...
WARNING: coverage.xml: no matching files
ERROR: No files to upload
Cleaning up file based variables
ERROR: Job failed: exit code 1
failed
build_macosx_37 Build
WARNING conda_build.build:tests_failed(2890): Tests failed for bob.pad.voice-1.0.11b0-py37h0442177_5.conda - moving package to /Users/gitlab/builds/b6d3167a/1/bob/bob.pad.voice/miniconda/conda-bld/broken
TESTS FAILED: bob.pad.voice-1.0.11b0-py37h0442177_5.conda
Uploading artifacts for failed job
Uploading artifacts...
Runtime platform
arch=amd64 os=darwin pid=4867 revision=e95f89a0 version=13.4.1
WARNING: coverage.xml: no matching files
ERROR: No files to upload
Cleaning up file based variables
ERROR: Job failed: exit status 1
failed
build_macosx_36 Build
WARNING conda_build.build:tests_failed(2890): Tests failed for bob.pad.voice-1.0.11b0-py36h0442177_5.conda - moving package to /Users/gitlab/builds/b6d3167a/0/bob/bob.pad.voice/miniconda/conda-bld/broken
TESTS FAILED: bob.pad.voice-1.0.11b0-py36h0442177_5.conda
Uploading artifacts for failed job
Uploading artifacts...
Runtime platform
arch=amd64 os=darwin pid=5222 revision=e95f89a0 version=13.4.1
WARNING: coverage.xml: no matching files
ERROR: No files to upload
Cleaning up file based variables
ERROR: Job failed: exit status 1