Update README.rst

12 jobs for master in 52 minutes and 33 seconds (queued for 2 seconds)
Name Stage Failure
failed
test_macosx_27 Test There is an unknown failure, please try again
profiling:invalid arc tag (0x45726f72)
profiling:invalid arc tag (0x0000000b)
profiling:invalid arc tag (0x00000000)
profiling:invalid arc tag (0x6c706d69)
profiling:invalid arc tag (0x725f6461)
profiling:invalid object tag (0x756f7365)
Running after script...
$ rm -rf ${CONDA_PREFIX}
ERROR: Build failed: exit status 1
failed
test_linux_34 Test There is an unknown failure, please try again
--------------------- >> end captured logging << ---------------------

----------------------------------------------------------------------
Ran 11 tests in 5.452s

FAILED (errors=2)
Running after script...
$ rm -rf ${CONDA_PREFIX}
ERROR: Build failed: exit status 1
failed
test_linux_27 Test There is an unknown failure, please try again
--------------------- >> end captured logging << ---------------------

----------------------------------------------------------------------
Ran 11 tests in 5.685s

FAILED (errors=2)
Running after script...
$ rm -rf ${CONDA_PREFIX}
ERROR: Build failed: exit status 1
failed
test_linux_35 Test There is an unknown failure, please try again
--------------------- >> end captured logging << ---------------------

----------------------------------------------------------------------
Ran 11 tests in 4.813s

FAILED (errors=2)
Running after script...
$ rm -rf ${CONDA_PREFIX}
ERROR: Build failed: exit status 1
failed
test_macosx_35 Test There is an unknown failure, please try again
profiling:invalid arc tag (0x45726f72)
profiling:invalid arc tag (0x0000000b)
profiling:invalid arc tag (0x00000000)
profiling:invalid arc tag (0x6c706d69)
profiling:invalid arc tag (0x725f6461)
profiling:invalid object tag (0x756f7365)
Running after script...
$ rm -rf ${CONDA_PREFIX}
ERROR: Build failed: exit status 1
failed
test_macosx_34 Test There is an unknown failure, please try again
profiling:invalid arc tag (0x45726f72)
profiling:invalid arc tag (0x0000000b)
profiling:invalid arc tag (0x00000000)
profiling:invalid arc tag (0x6c706d69)
profiling:invalid arc tag (0x725f6461)
profiling:invalid object tag (0x756f7365)
Running after script...
$ rm -rf ${CONDA_PREFIX}
ERROR: Build failed: exit status 1