Fix tests

27 jobs for master in 58 minutes and 22 seconds (queued for 3 seconds)
Name Stage Failure
failed
build_macosx_27 Build There is an unknown failure, please try again
Exceeded max retries, giving upError:     LOCKERROR: It looks like conda is already doing something.
The lock ['/opt/conda/pkgs/.conda_lock-60404'] was found. Wait for it to finish before continuing.
If you are sure that conda is not running, remove it and try again.
You can also use: $ conda clean --lock

[(Mon Oct 3 23:55:36 2016)!!] Command Failed "/opt/conda/bin/conda create --prefix /Users/buildbot/work/gitlab-ci/f6f95b82/0/bob/bob.pad.voice/env --file env.txt --yes"
Running after script...
$ rm -rf ${CONDA_PREFIX}
ERROR: Build failed: exit status 1
failed
test_linux_27 Test There is an unknown failure, please try again
--------------------- >> end captured logging << ---------------------

----------------------------------------------------------------------
Ran 11 tests in 4.549s

FAILED (errors=2)
Running after script...
$ rm -rf ${CONDA_PREFIX}
ERROR: Build failed: exit status 1
failed
test_macosx_35 Test There is an unknown failure, please try again
FAILED (errors=2)
['/Users/buildbot/work/gitlab-ci/work/gitlab-ci/f6f95b82/2/bob/bob.pad.voice/env/lib/python3.5/site-packages/bob/pad/voice/test/data/genuine_laptop_sentence01.wav', '/Users/buildbot/work/gitlab-ci/work/gitlab-ci/f6f95b82/2/bob/bob.pad.voice/env/lib/python3.5/site-packages/bob/pad/voice/test/data/attack_laptop_sentence01.wav']
Files for database 'speech_spoof_test':
/Users/buildbot/work/gitlab-ci/work/gitlab-ci/f6f95b82/2/bob/bob.pad.voice/env/lib/python3.5/site-packages/bob/pad/voice/test/dummy/*.wav
-d 'dummy-speech' -p 'mod-4hz' -e 'lbp-hist' -a 'logregr' -vs 'test_energylbp' --groups '['dev', 'eval']' --temp-directory /var/folders/8n/phc2t7ln52l2srkgv49ybfj00001fc/T/bobtest_uibke37p --result-directory /var/folders/8n/phc2t7ln52l2srkgv49ybfj00001fc/T/bobtest_uibke37p
-d 'bob.pad.voice.test.dummy.database.DummyDatabaseSpeechSpoof()' -p 'bob.bio.spear.preprocessor.Mod_4Hz()' -e 'bob.pad.voice.extractor.LBPHistograms(features_processor=bob.pad.voice.extractor.SpectrogramExtended())' -a 'bob.pad.voice.algorithm.LogRegrAlgorithm()' -vs 'test_energylbp' --temp-directory /var/folders/8n/phc2t7ln52l2srkgv49ybfj00001fc/T/bobtest_j8i5_ag8 --result-directory /var/folders/8n/phc2t7ln52l2srkgv49ybfj00001fc/T/bobtest_j8i5_ag8
Running after script...
$ rm -rf ${CONDA_PREFIX}
ERROR: Build failed: exit status 1
failed
test_linux_34 Test There is an unknown failure, please try again
FAILED (errors=2)
['/local/gitlab-runner/builds/6b02994f/1/bob/bob.pad.voice/env/lib/python3.4/site-packages/bob/pad/voice/test/data/genuine_laptop_sentence01.wav', '/local/gitlab-runner/builds/6b02994f/1/bob/bob.pad.voice/env/lib/python3.4/site-packages/bob/pad/voice/test/data/attack_laptop_sentence01.wav']
Files for database 'speech_spoof_test':
/local/gitlab-runner/builds/6b02994f/1/bob/bob.pad.voice/env/lib/python3.4/site-packages/bob/pad/voice/test/dummy/*.wav
-d 'dummy-speech' -p 'mod-4hz' -e 'lbp-hist' -a 'logregr' -vs 'test_energylbp' --groups '['dev', 'eval']' --temp-directory /tmp/bobtest_gq43dhju --result-directory /tmp/bobtest_gq43dhju
-d 'bob.pad.voice.test.dummy.database.DummyDatabaseSpeechSpoof()' -p 'bob.bio.spear.preprocessor.Mod_4Hz()' -e 'bob.pad.voice.extractor.LBPHistograms(features_processor=bob.pad.voice.extractor.SpectrogramExtended())' -a 'bob.pad.voice.algorithm.LogRegrAlgorithm()' -vs 'test_energylbp' --temp-directory /tmp/bobtest_3kyyj_38 --result-directory /tmp/bobtest_3kyyj_38
Running after script...
$ rm -rf ${CONDA_PREFIX}
ERROR: Build failed: exit status 1
failed
test_linux_35 Test There is an unknown failure, please try again
FAILED (errors=2)
['/local/gitlab-runner/builds/6b02994f/2/bob/bob.pad.voice/env/lib/python3.5/site-packages/bob/pad/voice/test/data/genuine_laptop_sentence01.wav', '/local/gitlab-runner/builds/6b02994f/2/bob/bob.pad.voice/env/lib/python3.5/site-packages/bob/pad/voice/test/data/attack_laptop_sentence01.wav']
Files for database 'speech_spoof_test':
/local/gitlab-runner/builds/6b02994f/2/bob/bob.pad.voice/env/lib/python3.5/site-packages/bob/pad/voice/test/dummy/*.wav
-d 'dummy-speech' -p 'mod-4hz' -e 'lbp-hist' -a 'logregr' -vs 'test_energylbp' --groups '['dev', 'eval']' --temp-directory /tmp/bobtest_6260x5li --result-directory /tmp/bobtest_6260x5li
-d 'bob.pad.voice.test.dummy.database.DummyDatabaseSpeechSpoof()' -p 'bob.bio.spear.preprocessor.Mod_4Hz()' -e 'bob.pad.voice.extractor.LBPHistograms(features_processor=bob.pad.voice.extractor.SpectrogramExtended())' -a 'bob.pad.voice.algorithm.LogRegrAlgorithm()' -vs 'test_energylbp' --temp-directory /tmp/bobtest_oi40nmt3 --result-directory /tmp/bobtest_oi40nmt3
Running after script...
$ rm -rf ${CONDA_PREFIX}
ERROR: Build failed: exit status 1
failed
test_macosx_27 Test There is an unknown failure, please try again
FAILED (errors=2)
['/Users/buildbot/work/gitlab-ci/work/gitlab-ci/f6f95b82/0/bob/bob.pad.voice/env/lib/python2.7/site-packages/bob/pad/voice/test/data/genuine_laptop_sentence01.wav', '/Users/buildbot/work/gitlab-ci/work/gitlab-ci/f6f95b82/0/bob/bob.pad.voice/env/lib/python2.7/site-packages/bob/pad/voice/test/data/attack_laptop_sentence01.wav']
Files for database 'speech_spoof_test':
/Users/buildbot/work/gitlab-ci/work/gitlab-ci/f6f95b82/0/bob/bob.pad.voice/env/lib/python2.7/site-packages/bob/pad/voice/test/dummy/*.wav
-d 'dummy-speech' -p 'mod-4hz' -e 'lbp-hist' -a 'logregr' -vs 'test_energylbp' --groups '['dev', 'eval']' --temp-directory /var/folders/8n/phc2t7ln52l2srkgv49ybfj00001fc/T/bobtest_FC9tKV --result-directory /var/folders/8n/phc2t7ln52l2srkgv49ybfj00001fc/T/bobtest_FC9tKV
-d 'bob.pad.voice.test.dummy.database.DummyDatabaseSpeechSpoof()' -p 'bob.bio.spear.preprocessor.Mod_4Hz()' -e 'bob.pad.voice.extractor.LBPHistograms(features_processor=bob.pad.voice.extractor.SpectrogramExtended())' -a 'bob.pad.voice.algorithm.LogRegrAlgorithm()' -vs 'test_energylbp' --temp-directory /var/folders/8n/phc2t7ln52l2srkgv49ybfj00001fc/T/bobtest_j4tAH_ --result-directory /var/folders/8n/phc2t7ln52l2srkgv49ybfj00001fc/T/bobtest_j4tAH_
Running after script...
$ rm -rf ${CONDA_PREFIX}
ERROR: Build failed: exit status 1
failed
test_macosx_34 Test There is an unknown failure, please try again
FAILED (errors=2)
['/Users/buildbot/work/gitlab-ci/work/gitlab-ci/f6f95b82/1/bob/bob.pad.voice/env/lib/python3.4/site-packages/bob/pad/voice/test/data/genuine_laptop_sentence01.wav', '/Users/buildbot/work/gitlab-ci/work/gitlab-ci/f6f95b82/1/bob/bob.pad.voice/env/lib/python3.4/site-packages/bob/pad/voice/test/data/attack_laptop_sentence01.wav']
Files for database 'speech_spoof_test':
/Users/buildbot/work/gitlab-ci/work/gitlab-ci/f6f95b82/1/bob/bob.pad.voice/env/lib/python3.4/site-packages/bob/pad/voice/test/dummy/*.wav
-d 'dummy-speech' -p 'mod-4hz' -e 'lbp-hist' -a 'logregr' -vs 'test_energylbp' --groups '['dev', 'eval']' --temp-directory /var/folders/8n/phc2t7ln52l2srkgv49ybfj00001fc/T/bobtest_50jng6cu --result-directory /var/folders/8n/phc2t7ln52l2srkgv49ybfj00001fc/T/bobtest_50jng6cu
-d 'bob.pad.voice.test.dummy.database.DummyDatabaseSpeechSpoof()' -p 'bob.bio.spear.preprocessor.Mod_4Hz()' -e 'bob.pad.voice.extractor.LBPHistograms(features_processor=bob.pad.voice.extractor.SpectrogramExtended())' -a 'bob.pad.voice.algorithm.LogRegrAlgorithm()' -vs 'test_energylbp' --temp-directory /var/folders/8n/phc2t7ln52l2srkgv49ybfj00001fc/T/bobtest_ky74qghc --result-directory /var/folders/8n/phc2t7ln52l2srkgv49ybfj00001fc/T/bobtest_ky74qghc
Running after script...
$ rm -rf ${CONDA_PREFIX}
ERROR: Build failed: exit status 1