Add SWAN database

4 jobs for new-db in 7 minutes and 42 seconds (queued for 5 seconds)
Status Job ID Name Coverage
  Build
failed #226951
docker
build_linux_37

00:05:20

64.0%
failed #226952
docker
build_linux_38

00:04:55

64.0%
failed #226949
intel macos
build_macos_intel_37

00:07:38

64.0%
failed #226950
intel macos
build_macos_intel_38

00:07:29

64.0%
 
Name Stage Failure
failed
build_macos_intel_37 Build
Tests failed for bob.pad.face-2.2.4b0-py37he6f1aaa_70.conda - moving package to /Users/gitlab/builds/nrU4yQP1/0/bob/bob.pad.face/miniconda/conda-bld/broken
TESTS FAILED: bob.pad.face-2.2.4b0-py37he6f1aaa_70.conda
Uploading artifacts for failed job
Uploading artifacts...
Runtime platform
arch=amd64 os=darwin pid=39512 revision=2ebc4dc4 version=13.9.0
WARNING: coverage.xml: no matching files
ERROR: No files to upload
Cleaning up file based variables
ERROR: Job failed: exit status 1
failed
build_macos_intel_38 Build
Tests failed for bob.pad.face-2.2.4b0-py38he6f1aaa_33.conda - moving package to /Users/gitlab/builds/nrU4yQP1/1/bob/bob.pad.face/miniconda/conda-bld/broken
TESTS FAILED: bob.pad.face-2.2.4b0-py38he6f1aaa_33.conda
Uploading artifacts for failed job
Uploading artifacts...
Runtime platform
arch=amd64 os=darwin pid=39490 revision=2ebc4dc4 version=13.9.0
WARNING: coverage.xml: no matching files
ERROR: No files to upload
Cleaning up file based variables
ERROR: Job failed: exit status 1
failed
build_linux_37 Build
FAILED (SKIP=2, errors=1)
Tests failed for bob.pad.face-2.2.4b0-py37h99a6fcd_89.conda - moving package to /scratch/builds/bob/bob.pad.face/miniconda/conda-bld/broken
TESTS FAILED: bob.pad.face-2.2.4b0-py37h99a6fcd_89.conda
Uploading artifacts for failed job
Uploading artifacts...
WARNING: coverage.xml: no matching files
ERROR: No files to upload
Cleaning up file based variables
ERROR: Job failed: exit code 1
failed
build_linux_38 Build
FAILED (SKIP=2, errors=1)
Tests failed for bob.pad.face-2.2.4b0-py38h99a6fcd_35.conda - moving package to /scratch/builds/bob/bob.pad.face/miniconda/conda-bld/broken
TESTS FAILED: bob.pad.face-2.2.4b0-py38h99a6fcd_35.conda
Uploading artifacts for failed job
Uploading artifacts...
WARNING: coverage.xml: no matching files
ERROR: No files to upload
Cleaning up file based variables
ERROR: Job failed: exit code 1