convert databases to use the new csv format from bob.pipelines

8 jobs for new-db in 7 minutes and 12 seconds (queued for 4 seconds)
Status Job ID Name Coverage
  Build
failed #226462
docker
build_linux_37

00:04:25

64.0%
failed #226463
docker
build_linux_38

00:04:12

64.0%
failed #226460
intel macos
build_macos_intel_37

00:07:12

64.0%
failed #226461
intel macos
build_macos_intel_38

00:06:58

64.0%
failed #226445
docker
build_linux_37

00:03:47

49.0%
failed #226446
docker
build_linux_38

00:03:34

49.0%
failed #226443
intel macos
build_macos_intel_37

00:07:20

49.0%
failed #226444
intel macos
build_macos_intel_38

00:07:10

49.0%
 
Name Stage Failure
failed
build_macos_intel_37 Build
Tests failed for bob.pad.face-2.2.4b0-py37heaa3afe_67.conda - moving package to /Users/gitlab/builds/nrU4yQP1/0/bob/bob.pad.face/miniconda/conda-bld/broken
TESTS FAILED: bob.pad.face-2.2.4b0-py37heaa3afe_67.conda
Uploading artifacts for failed job
Uploading artifacts...
Runtime platform
arch=amd64 os=darwin pid=36196 revision=2ebc4dc4 version=13.9.0
WARNING: coverage.xml: no matching files
ERROR: No files to upload
Cleaning up file based variables
ERROR: Job failed: exit status 1
failed
build_macos_intel_38 Build
Tests failed for bob.pad.face-2.2.4b0-py38heaa3afe_30.conda - moving package to /Users/gitlab/builds/nrU4yQP1/1/bob/bob.pad.face/miniconda/conda-bld/broken
TESTS FAILED: bob.pad.face-2.2.4b0-py38heaa3afe_30.conda
Uploading artifacts for failed job
Uploading artifacts...
Runtime platform
arch=amd64 os=darwin pid=36176 revision=2ebc4dc4 version=13.9.0
WARNING: coverage.xml: no matching files
ERROR: No files to upload
Cleaning up file based variables
ERROR: Job failed: exit status 1
failed
build_linux_37 Build
FAILED (errors=2)
Tests failed for bob.pad.face-2.2.4b0-py37hf04ab89_86.conda - moving package to /scratch/builds/bob/bob.pad.face/miniconda/conda-bld/broken
TESTS FAILED: bob.pad.face-2.2.4b0-py37hf04ab89_86.conda
Uploading artifacts for failed job
Uploading artifacts...
WARNING: coverage.xml: no matching files
ERROR: No files to upload
Cleaning up file based variables
ERROR: Job failed: exit code 1
failed
build_linux_38 Build
FAILED (errors=2)
Tests failed for bob.pad.face-2.2.4b0-py38hf04ab89_32.conda - moving package to /scratch/builds/bob/bob.pad.face/miniconda/conda-bld/broken
TESTS FAILED: bob.pad.face-2.2.4b0-py38hf04ab89_32.conda
Uploading artifacts for failed job
Uploading artifacts...
WARNING: coverage.xml: no matching files
ERROR: No files to upload
Cleaning up file based variables
ERROR: Job failed: exit code 1