port replay attack and replay mobile interfaces

4 jobs for new-db in 7 minutes and 22 seconds (queued for 2 seconds)
Status Job ID Name Coverage
  Build
failed #225825
docker
build_linux_37

00:03:46

failed #225826
docker
build_linux_38

00:03:31

failed #225823
intel macos
build_macos_intel_37

00:07:16

failed #225824
intel macos
build_macos_intel_38

00:07:10

 
Name Stage Failure
failed
build_macos_intel_37 Build
Tests failed for bob.pad.face-2.2.4b0-py37heaa3afe_62.conda - moving package to /Users/gitlab/builds/nrU4yQP1/0/bob/bob.pad.face/miniconda/conda-bld/broken
TESTS FAILED: bob.pad.face-2.2.4b0-py37heaa3afe_62.conda
Uploading artifacts for failed job
Uploading artifacts...
Runtime platform
arch=amd64 os=darwin pid=42609 revision=2ebc4dc4 version=13.9.0
WARNING: coverage.xml: no matching files
ERROR: No files to upload
Cleaning up file based variables
ERROR: Job failed: exit status 1
failed
build_macos_intel_38 Build
Tests failed for bob.pad.face-2.2.4b0-py38heaa3afe_25.conda - moving package to /Users/gitlab/builds/nrU4yQP1/1/bob/bob.pad.face/miniconda/conda-bld/broken
TESTS FAILED: bob.pad.face-2.2.4b0-py38heaa3afe_25.conda
Uploading artifacts for failed job
Uploading artifacts...
Runtime platform
arch=amd64 os=darwin pid=42522 revision=2ebc4dc4 version=13.9.0
WARNING: coverage.xml: no matching files
ERROR: No files to upload
Cleaning up file based variables
ERROR: Job failed: exit status 1
failed
build_linux_37 Build
ImportError: cannot import name 'Str_To_Types' from 'bob.pipelines.transformers' (/scratch/builds/bob/bob.pad.face/miniconda/conda-bld/bob.pad.face_1615834990824/_test_env_placehold_placehold_placehold_placehold_placehold_placehold_placehold_placehold_placehold_placehold_placehold_placehold_placehold_placehold_placehold_placehold_pla/lib/python3.7/site-packages/bob/pipelines/transformers/__init__.py)
Tests failed for bob.pad.face-2.2.4b0-py37hf04ab89_80.conda - moving package to /scratch/builds/bob/bob.pad.face/miniconda/conda-bld/broken
TESTS FAILED: bob.pad.face-2.2.4b0-py37hf04ab89_80.conda
Uploading artifacts for failed job
Uploading artifacts...
WARNING: coverage.xml: no matching files
ERROR: No files to upload
Cleaning up file based variables
ERROR: Job failed: exit code 1
failed
build_linux_38 Build
ImportError: cannot import name 'Str_To_Types' from 'bob.pipelines.transformers' (/scratch/builds/bob/bob.pad.face/miniconda/conda-bld/bob.pad.face_1615834980697/_test_env_placehold_placehold_placehold_placehold_placehold_placehold_placehold_placehold_placehold_placehold_placehold_placehold_placehold_placehold_placehold_placehold_pla/lib/python3.8/site-packages/bob/pipelines/transformers/__init__.py)
Tests failed for bob.pad.face-2.2.4b0-py38hf04ab89_26.conda - moving package to /scratch/builds/bob/bob.pad.face/miniconda/conda-bld/broken
TESTS FAILED: bob.pad.face-2.2.4b0-py38hf04ab89_26.conda
Uploading artifacts for failed job
Uploading artifacts...
WARNING: coverage.xml: no matching files
ERROR: No files to upload
Cleaning up file based variables
ERROR: Job failed: exit code 1