WIP: port databases to the new csv format

8 jobs for new-db in 10 minutes and 58 seconds (queued for 3 seconds)
Status Job ID Name Coverage
  Build
failed #225503
docker
build_linux_37

00:03:38

failed #225469
docker
build_linux_38

00:03:57

failed #225466
intel macos
build_macos_intel_37

00:07:12

failed #225467
intel macos
build_macos_intel_38

00:07:10

failed #225502
docker
build_linux_37

00:00:08

failed #225501
docker
build_linux_37

00:00:08

failed #225500
docker
build_linux_37

00:00:08

failed #225468
docker
build_linux_37

00:04:07

 
Name Stage Failure
failed
build_linux_37 Build
ImportError: cannot import name 'Str_To_Types' from 'bob.pipelines.transformers' (/scratch/builds/bob/bob.pad.face/miniconda/conda-bld/bob.pad.face_1615409117379/_test_env_placehold_placehold_placehold_placehold_placehold_placehold_placehold_placehold_placehold_placehold_placehold_placehold_placehold_placehold_placehold_placehold_pla/lib/python3.7/site-packages/bob/pipelines/transformers/__init__.py)
Tests failed for bob.pad.face-2.2.4b0-py37hf04ab89_78.conda - moving package to /scratch/builds/bob/bob.pad.face/miniconda/conda-bld/broken
TESTS FAILED: bob.pad.face-2.2.4b0-py37hf04ab89_78.conda
Uploading artifacts for failed job
Uploading artifacts...
WARNING: coverage.xml: no matching files
ERROR: No files to upload
Cleaning up file based variables
ERROR: Job failed: exit code 1
failed
build_macos_intel_37 Build
Tests failed for bob.pad.face-2.2.4b0-py37heaa3afe_60.conda - moving package to /Users/gitlab/builds/nrU4yQP1/0/bob/bob.pad.face/miniconda/conda-bld/broken
TESTS FAILED: bob.pad.face-2.2.4b0-py37heaa3afe_60.conda
Uploading artifacts for failed job
Uploading artifacts...
Runtime platform
arch=amd64 os=darwin pid=46809 revision=2ebc4dc4 version=13.9.0
WARNING: coverage.xml: no matching files
ERROR: No files to upload
Cleaning up file based variables
ERROR: Job failed: exit status 1
failed
build_macos_intel_38 Build
Tests failed for bob.pad.face-2.2.4b0-py38heaa3afe_23.conda - moving package to /Users/gitlab/builds/nrU4yQP1/1/bob/bob.pad.face/miniconda/conda-bld/broken
TESTS FAILED: bob.pad.face-2.2.4b0-py38heaa3afe_23.conda
Uploading artifacts for failed job
Uploading artifacts...
Runtime platform
arch=amd64 os=darwin pid=46792 revision=2ebc4dc4 version=13.9.0
WARNING: coverage.xml: no matching files
ERROR: No files to upload
Cleaning up file based variables
ERROR: Job failed: exit status 1
failed
build_linux_38 Build
ImportError: cannot import name 'Str_To_Types' from 'bob.pipelines.transformers' (/scratch/builds/bob/bob.pad.face/miniconda/conda-bld/bob.pad.face_1615383566090/_test_env_placehold_placehold_placehold_placehold_placehold_placehold_placehold_placehold_placehold_placehold_placehold_placehold_placehold_placehold_placehold_placehold_pla/lib/python3.8/site-packages/bob/pipelines/transformers/__init__.py)
Tests failed for bob.pad.face-2.2.4b0-py38hf04ab89_23.conda - moving package to /scratch/builds/bob/bob.pad.face/miniconda/conda-bld/broken
TESTS FAILED: bob.pad.face-2.2.4b0-py38hf04ab89_23.conda
Uploading artifacts for failed job
Uploading artifacts...
WARNING: coverage.xml: no matching files
ERROR: No files to upload
Cleaning up file based variables
ERROR: Job failed: exit code 1