optimize the qm-svm pipeline

4 jobs for dask-pipelines in 5 minutes and 35 seconds (queued for 9 seconds)
Status Job ID Name Coverage
  Build
failed #213852
docker
build_linux_36

00:05:30

31.0%
failed #213853
docker
build_linux_37

00:05:32

31.0%
failed #213850
macosx
build_macosx_36

00:05:05

31.0%
failed #213851
macosx
build_macosx_37

00:05:04

31.0%
 
Name Stage Failure
failed
build_linux_37 Build
Tests failed for bob.pad.face-2.2.4b0-py37h9708f58_18.conda - moving package to /scratch/builds/bob/bob.pad.face/miniconda/conda-bld/broken
WARNING conda_build.build:tests_failed(2890): Tests failed for bob.pad.face-2.2.4b0-py37h9708f58_18.conda - moving package to /scratch/builds/bob/bob.pad.face/miniconda/conda-bld/broken
TESTS FAILED: bob.pad.face-2.2.4b0-py37h9708f58_18.conda
Uploading artifacts for failed job
Uploading artifacts...
WARNING: coverage.xml: no matching files
ERROR: No files to upload
Cleaning up file based variables
ERROR: Job failed: exit code 1
failed
build_linux_36 Build
Tests failed for bob.pad.face-2.2.4b0-py36h9708f58_18.conda - moving package to /scratch/builds/bob/bob.pad.face/miniconda/conda-bld/broken
WARNING conda_build.build:tests_failed(2890): Tests failed for bob.pad.face-2.2.4b0-py36h9708f58_18.conda - moving package to /scratch/builds/bob/bob.pad.face/miniconda/conda-bld/broken
TESTS FAILED: bob.pad.face-2.2.4b0-py36h9708f58_18.conda
Uploading artifacts for failed job
Uploading artifacts...
WARNING: coverage.xml: no matching files
ERROR: No files to upload
Cleaning up file based variables
ERROR: Job failed: exit code 1
failed
build_macosx_37 Build
WARNING conda_build.build:tests_failed(2890): Tests failed for bob.pad.face-2.2.4b0-py37h9708f58_17.conda - moving package to /Users/gitlab/builds/b6d3167a/1/bob/bob.pad.face/miniconda/conda-bld/broken
TESTS FAILED: bob.pad.face-2.2.4b0-py37h9708f58_17.conda
Uploading artifacts for failed job
Uploading artifacts...
Runtime platform
arch=amd64 os=darwin pid=29415 revision=e95f89a0 version=13.4.1
WARNING: coverage.xml: no matching files
ERROR: No files to upload
Cleaning up file based variables
ERROR: Job failed: exit status 1
failed
build_macosx_36 Build
WARNING conda_build.build:tests_failed(2890): Tests failed for bob.pad.face-2.2.4b0-py36h9708f58_15.conda - moving package to /Users/gitlab/builds/b6d3167a/0/bob/bob.pad.face/miniconda/conda-bld/broken
TESTS FAILED: bob.pad.face-2.2.4b0-py36h9708f58_15.conda
Uploading artifacts for failed job
Uploading artifacts...
Runtime platform
arch=amd64 os=darwin pid=29401 revision=e95f89a0 version=13.4.1
WARNING: coverage.xml: no matching files
ERROR: No files to upload
Cleaning up file based variables
ERROR: Job failed: exit status 1