Added unseen attack protocols

4 jobs for transform_annotations in 13 minutes and 4 seconds (queued for 2 seconds)
latest
Status Job ID Name Coverage
  Build
failed #196336
docker
build_linux_36

00:04:43

failed #196337
docker
build_linux_37

00:04:36

failed #196334
macosx
build_macosx_36

00:12:59

failed #196335
macosx
build_macosx_37

00:12:56

 
Name Stage Failure
failed
build_macosx_36 Build
WARNING:conda_build.build:Tests failed for bob.pad.face-2.2.2b0-py36hf1375e8_0.conda - moving package to /Users/gitlab/builds/f6f95b82/0/bob/bob.pad.face/miniconda/conda-bld/broken
TESTS FAILED: bob.pad.face-2.2.2b0-py36hf1375e8_0.conda
Running after_script
Uploading artifacts for failed job
Uploading artifacts...
Runtime platform
arch=amd64 os=darwin pid=65962 revision=4c96e5ad version=12.9.0
WARNING: coverage.xml: no matching files
ERROR: No files to upload
ERROR: Job failed: exit status 1
failed
build_macosx_37 Build
WARNING:conda_build.build:Tests failed for bob.pad.face-2.2.2b0-py37hf1375e8_0.conda - moving package to /Users/gitlab/builds/f6f95b82/1/bob/bob.pad.face/miniconda/conda-bld/broken
TESTS FAILED: bob.pad.face-2.2.2b0-py37hf1375e8_0.conda
Running after_script
Uploading artifacts for failed job
Uploading artifacts...
Runtime platform
arch=amd64 os=darwin pid=65947 revision=4c96e5ad version=12.9.0
WARNING: coverage.xml: no matching files
ERROR: No files to upload
ERROR: Job failed: exit status 1
failed
build_linux_36 Build
Tests failed for bob.pad.face-2.2.2b0-py36hf1375e8_0.conda - moving package to /scratch/builds/bob/bob.pad.face/miniconda/conda-bld/broken
WARNING:conda_build.build:Tests failed for bob.pad.face-2.2.2b0-py36hf1375e8_0.conda - moving package to /scratch/builds/bob/bob.pad.face/miniconda/conda-bld/broken
TESTS FAILED: bob.pad.face-2.2.2b0-py36hf1375e8_0.conda
Running after_script
Uploading artifacts for failed job
Uploading artifacts...
WARNING: coverage.xml: no matching files
ERROR: No files to upload
ERROR: Job failed: exit code 1
failed
build_linux_37 Build
Tests failed for bob.pad.face-2.2.2b0-py37hf1375e8_0.conda - moving package to /scratch/builds/bob/bob.pad.face/miniconda/conda-bld/broken
WARNING:conda_build.build:Tests failed for bob.pad.face-2.2.2b0-py37hf1375e8_0.conda - moving package to /scratch/builds/bob/bob.pad.face/miniconda/conda-bld/broken
TESTS FAILED: bob.pad.face-2.2.2b0-py37hf1375e8_0.conda
Running after_script
Uploading artifacts for failed job
Uploading artifacts...
WARNING: coverage.xml: no matching files
ERROR: No files to upload
ERROR: Job failed: exit code 1