Save the reprojected annotations

4 jobs for transform_annotations in 5 minutes and 51 seconds (queued for 5 seconds)
Status Job ID Name Coverage
  Build
failed #195672
docker
build_linux_36

00:05:42

failed #195673
docker
build_linux_37

00:05:49

failed #195670
macosx
build_macosx_36

00:05:20

failed #195671
macosx
build_macosx_37

00:05:01

 
Name Stage Failure
failed
build_linux_37 Build
  File "/scratch/builds/bob/bob.pad.face/miniconda/conda-bld/bob.pad.face_1587390371023/_test_env_placehold_placehold_placehold_placehold_placehold_placehold_placehold_placehold_placehold_placehold_placehold_placehold_placehold_placehold_placehold_placehold_pla/lib/python3.7/site-packages/bob/pad/face/database/hqwmca.py", line 12, in <module>
from bob.db.hqwmca.attack_dictionaries import idiap_type_id_config, idiap_subtype_id_config
ModuleNotFoundError: No module named 'bob.db.hqwmca'
Tests failed for bob.pad.face-2.2.2b0-py37hf1375e8_0.conda - moving package to /scratch/builds/bob/bob.pad.face/miniconda/conda-bld/broken
WARNING:conda_build.build:Tests failed for bob.pad.face-2.2.2b0-py37hf1375e8_0.conda - moving package to /scratch/builds/bob/bob.pad.face/miniconda/conda-bld/broken
TESTS FAILED: bob.pad.face-2.2.2b0-py37hf1375e8_0.conda
Running after_script
Uploading artifacts for failed job
ERROR: Job failed: exit code 1
failed
build_linux_36 Build
  File "/scratch/builds/bob/bob.pad.face/miniconda/conda-bld/bob.pad.face_1587390359670/_test_env_placehold_placehold_placehold_placehold_placehold_placehold_placehold_placehold_placehold_placehold_placehold_placehold_placehold_placehold_placehold_placehold_pla/lib/python3.6/site-packages/bob/pad/face/database/hqwmca.py", line 12, in <module>
from bob.db.hqwmca.attack_dictionaries import idiap_type_id_config, idiap_subtype_id_config
ModuleNotFoundError: No module named 'bob.db.hqwmca'
Tests failed for bob.pad.face-2.2.2b0-py36hf1375e8_0.conda - moving package to /scratch/builds/bob/bob.pad.face/miniconda/conda-bld/broken
WARNING:conda_build.build:Tests failed for bob.pad.face-2.2.2b0-py36hf1375e8_0.conda - moving package to /scratch/builds/bob/bob.pad.face/miniconda/conda-bld/broken
TESTS FAILED: bob.pad.face-2.2.2b0-py36hf1375e8_0.conda
Running after_script
Uploading artifacts for failed job
ERROR: Job failed: exit code 1
failed
build_macosx_36 Build
  File "/Users/gitlab/builds/b6d3167a/0/bob/bob.pad.face/miniconda/conda-bld/bob.pad.face_1587390364397/_test_env_placehold_placehold_placehold_placehold_placehold_placehold_placehold_placehold_placehold_placehold_placehold_placehold_placehold_placehold_placeho/lib/python3.6/site-packages/bob/pad/face/database/hqwmca.py", line 12, in <module>
from bob.db.hqwmca.attack_dictionaries import idiap_type_id_config, idiap_subtype_id_config
ModuleNotFoundError: No module named 'bob.db.hqwmca'
Tests failed for bob.pad.face-2.2.2b0-py36hf1375e8_0.conda - moving package to /Users/gitlab/builds/b6d3167a/0/bob/bob.pad.face/miniconda/conda-bld/broken
WARNING:conda_build.build:Tests failed for bob.pad.face-2.2.2b0-py36hf1375e8_0.conda - moving package to /Users/gitlab/builds/b6d3167a/0/bob/bob.pad.face/miniconda/conda-bld/broken
TESTS FAILED: bob.pad.face-2.2.2b0-py36hf1375e8_0.conda
Running after_script
Uploading artifacts for failed job
ERROR: Job failed: exit status 1
failed
build_macosx_37 Build
  File "/Users/gitlab/builds/b6d3167a/1/bob/bob.pad.face/miniconda/conda-bld/bob.pad.face_1587390351540/_test_env_placehold_placehold_placehold_placehold_placehold_placehold_placehold_placehold_placehold_placehold_placehold_placehold_placehold_placehold_placeho/lib/python3.7/site-packages/bob/pad/face/database/hqwmca.py", line 12, in <module>
from bob.db.hqwmca.attack_dictionaries import idiap_type_id_config, idiap_subtype_id_config
ModuleNotFoundError: No module named 'bob.db.hqwmca'
Tests failed for bob.pad.face-2.2.2b0-py37hf1375e8_0.conda - moving package to /Users/gitlab/builds/b6d3167a/1/bob/bob.pad.face/miniconda/conda-bld/broken
WARNING:conda_build.build:Tests failed for bob.pad.face-2.2.2b0-py37hf1375e8_0.conda - moving package to /Users/gitlab/builds/b6d3167a/1/bob/bob.pad.face/miniconda/conda-bld/broken
TESTS FAILED: bob.pad.face-2.2.2b0-py37hf1375e8_0.conda
Running after_script
Uploading artifacts for failed job
ERROR: Job failed: exit status 1