minor edits

4 jobs for transform_annotations in 13 minutes and 5 seconds (queued for 3 seconds)
Status Job ID Name Coverage
  Build
failed #195667
docker
build_linux_36

00:05:29

failed #195668
docker
build_linux_37

00:05:41

failed #195665
macosx
build_macosx_36

00:13:05

failed #195666
macosx
build_macosx_37

00:12:56

 
Name Stage Failure
failed
build_macosx_36 Build
  File "/Users/gitlab/builds/f6f95b82/0/bob/bob.pad.face/miniconda/conda-bld/bob.pad.face_1587390027704/_test_env_placehold_placehold_placehold_placehold_placehold_placehold_placehold_placehold_placehold_placehold_placehold_placehold_placehold_placehold_placeho/lib/python3.6/site-packages/bob/pad/face/database/hqwmca.py", line 12, in <module>
from bob.db.hqwmca.attack_dictionaries import idiap_type_id_config, idiap_subtype_id_config
ModuleNotFoundError: No module named 'bob.db.hqwmca'
Tests failed for bob.pad.face-2.2.2b0-py36hf1375e8_0.conda - moving package to /Users/gitlab/builds/f6f95b82/0/bob/bob.pad.face/miniconda/conda-bld/broken
WARNING:conda_build.build:Tests failed for bob.pad.face-2.2.2b0-py36hf1375e8_0.conda - moving package to /Users/gitlab/builds/f6f95b82/0/bob/bob.pad.face/miniconda/conda-bld/broken
TESTS FAILED: bob.pad.face-2.2.2b0-py36hf1375e8_0.conda
Running after_script
Uploading artifacts for failed job
ERROR: Job failed: exit status 1
failed
build_macosx_37 Build
  File "/Users/gitlab/builds/f6f95b82/1/bob/bob.pad.face/miniconda/conda-bld/bob.pad.face_1587390015271/_test_env_placehold_placehold_placehold_placehold_placehold_placehold_placehold_placehold_placehold_placehold_placehold_placehold_placehold_placehold_placeho/lib/python3.7/site-packages/bob/pad/face/database/hqwmca.py", line 12, in <module>
from bob.db.hqwmca.attack_dictionaries import idiap_type_id_config, idiap_subtype_id_config
ModuleNotFoundError: No module named 'bob.db.hqwmca'
Tests failed for bob.pad.face-2.2.2b0-py37hf1375e8_0.conda - moving package to /Users/gitlab/builds/f6f95b82/1/bob/bob.pad.face/miniconda/conda-bld/broken
WARNING:conda_build.build:Tests failed for bob.pad.face-2.2.2b0-py37hf1375e8_0.conda - moving package to /Users/gitlab/builds/f6f95b82/1/bob/bob.pad.face/miniconda/conda-bld/broken
TESTS FAILED: bob.pad.face-2.2.2b0-py37hf1375e8_0.conda
Running after_script
Uploading artifacts for failed job
ERROR: Job failed: exit status 1
failed
build_linux_37 Build
  File "/scratch/builds/bob/bob.pad.face/miniconda/conda-bld/bob.pad.face_1587389880573/_test_env_placehold_placehold_placehold_placehold_placehold_placehold_placehold_placehold_placehold_placehold_placehold_placehold_placehold_placehold_placehold_placehold_pla/lib/python3.7/site-packages/bob/pad/face/database/hqwmca.py", line 12, in <module>
from bob.db.hqwmca.attack_dictionaries import idiap_type_id_config, idiap_subtype_id_config
ModuleNotFoundError: No module named 'bob.db.hqwmca'
Tests failed for bob.pad.face-2.2.2b0-py37hf1375e8_0.conda - moving package to /scratch/builds/bob/bob.pad.face/miniconda/conda-bld/broken
WARNING:conda_build.build:Tests failed for bob.pad.face-2.2.2b0-py37hf1375e8_0.conda - moving package to /scratch/builds/bob/bob.pad.face/miniconda/conda-bld/broken
TESTS FAILED: bob.pad.face-2.2.2b0-py37hf1375e8_0.conda
Running after_script
Uploading artifacts for failed job
ERROR: Job failed: exit code 1
failed
build_linux_36 Build
  File "/scratch/builds/bob/bob.pad.face/miniconda/conda-bld/bob.pad.face_1587389883328/_test_env_placehold_placehold_placehold_placehold_placehold_placehold_placehold_placehold_placehold_placehold_placehold_placehold_placehold_placehold_placehold_placehold_pla/lib/python3.6/site-packages/bob/pad/face/database/hqwmca.py", line 12, in <module>
from bob.db.hqwmca.attack_dictionaries import idiap_type_id_config, idiap_subtype_id_config
ModuleNotFoundError: No module named 'bob.db.hqwmca'
Tests failed for bob.pad.face-2.2.2b0-py36hf1375e8_0.conda - moving package to /scratch/builds/bob/bob.pad.face/miniconda/conda-bld/broken
WARNING:conda_build.build:Tests failed for bob.pad.face-2.2.2b0-py36hf1375e8_0.conda - moving package to /scratch/builds/bob/bob.pad.face/miniconda/conda-bld/broken
TESTS FAILED: bob.pad.face-2.2.2b0-py36hf1375e8_0.conda
Running after_script
Uploading artifacts for failed job
ERROR: Job failed: exit code 1