Fix

4 jobs for resize_stream_api in 8 minutes and 41 seconds (queued for 6 seconds)
latest
Status Job ID Name Coverage
  Build
failed #194386
docker
build_linux_36

00:04:44

failed #194387
docker
build_linux_37

00:04:45

failed #194384
macosx
build_macosx_36

00:03:57

failed #194385
macosx
build_macosx_37

00:08:40

 
Name Stage Failure
failed
build_macosx_37 Build
  File "/Users/gitlab/builds/f6f95b82/0/bob/bob.pad.face/miniconda/conda-bld/bob.pad.face_1586181275882/_test_env_placehold_placehold_placehold_placehold_placehold_placehold_placehold_placehold_placehold_placehold_placehold_placehold_placehold_placehold_placeho/lib/python3.7/site-packages/bob/pad/face/database/hqwmca.py", line 11, in <module>
from bob.db.hqwmca.attack_dictionaries import idiap_type_id_config, idiap_subtype_id_config
ModuleNotFoundError: No module named 'bob.db.hqwmca'
Tests failed for bob.pad.face-2.2.2b0-py37hf1375e8_0.conda - moving package to /Users/gitlab/builds/f6f95b82/0/bob/bob.pad.face/miniconda/conda-bld/broken
WARNING:conda_build.build:Tests failed for bob.pad.face-2.2.2b0-py37hf1375e8_0.conda - moving package to /Users/gitlab/builds/f6f95b82/0/bob/bob.pad.face/miniconda/conda-bld/broken
TESTS FAILED: bob.pad.face-2.2.2b0-py37hf1375e8_0.conda
Running after_script
Uploading artifacts for failed job
ERROR: Job failed: exit status 1
failed
build_linux_37 Build
  File "/scratch/builds/bob/bob.pad.face/miniconda/conda-bld/bob.pad.face_1586181221660/_test_env_placehold_placehold_placehold_placehold_placehold_placehold_placehold_placehold_placehold_placehold_placehold_placehold_placehold_placehold_placehold_placehold_pla/lib/python3.7/site-packages/bob/pad/face/database/hqwmca.py", line 11, in <module>
from bob.db.hqwmca.attack_dictionaries import idiap_type_id_config, idiap_subtype_id_config
ModuleNotFoundError: No module named 'bob.db.hqwmca'
Tests failed for bob.pad.face-2.2.2b0-py37hf1375e8_0.conda - moving package to /scratch/builds/bob/bob.pad.face/miniconda/conda-bld/broken
WARNING:conda_build.build:Tests failed for bob.pad.face-2.2.2b0-py37hf1375e8_0.conda - moving package to /scratch/builds/bob/bob.pad.face/miniconda/conda-bld/broken
TESTS FAILED: bob.pad.face-2.2.2b0-py37hf1375e8_0.conda
Running after_script
Uploading artifacts for failed job
ERROR: Job failed: exit code 1
failed
build_linux_36 Build
  File "/scratch/builds/bob/bob.pad.face/miniconda/conda-bld/bob.pad.face_1586181227206/_test_env_placehold_placehold_placehold_placehold_placehold_placehold_placehold_placehold_placehold_placehold_placehold_placehold_placehold_placehold_placehold_placehold_pla/lib/python3.6/site-packages/bob/pad/face/database/hqwmca.py", line 11, in <module>
from bob.db.hqwmca.attack_dictionaries import idiap_type_id_config, idiap_subtype_id_config
ModuleNotFoundError: No module named 'bob.db.hqwmca'
Tests failed for bob.pad.face-2.2.2b0-py36hf1375e8_0.conda - moving package to /scratch/builds/bob/bob.pad.face/miniconda/conda-bld/broken
WARNING:conda_build.build:Tests failed for bob.pad.face-2.2.2b0-py36hf1375e8_0.conda - moving package to /scratch/builds/bob/bob.pad.face/miniconda/conda-bld/broken
TESTS FAILED: bob.pad.face-2.2.2b0-py36hf1375e8_0.conda
Running after_script
Uploading artifacts for failed job
ERROR: Job failed: exit code 1
failed
build_macosx_36 Build
  File "/Users/gitlab/builds/b6d3167a/2/bob/bob.pad.face/miniconda/conda-bld/bob.pad.face_1586181196706/_test_env_placehold_placehold_placehold_placehold_placehold_placehold_placehold_placehold_placehold_placehold_placehold_placehold_placehold_placehold_placeho/lib/python3.6/site-packages/bob/pad/face/database/hqwmca.py", line 11, in <module>
from bob.db.hqwmca.attack_dictionaries import idiap_type_id_config, idiap_subtype_id_config
ModuleNotFoundError: No module named 'bob.db.hqwmca'
Tests failed for bob.pad.face-2.2.2b0-py36hf1375e8_0.conda - moving package to /Users/gitlab/builds/b6d3167a/2/bob/bob.pad.face/miniconda/conda-bld/broken
WARNING:conda_build.build:Tests failed for bob.pad.face-2.2.2b0-py36hf1375e8_0.conda - moving package to /Users/gitlab/builds/b6d3167a/2/bob/bob.pad.face/miniconda/conda-bld/broken
TESTS FAILED: bob.pad.face-2.2.2b0-py36hf1375e8_0.conda
Running after_script
Uploading artifacts for failed job
ERROR: Job failed: exit status 1