[FaceCropAlign] inversed x,y coordinates when getting eyes and mouth center,...

[FaceCropAlign] inversed x,y coordinates when getting eyes and mouth center, to be consistent with how annotations are computed and sored
4 jobs for add-hqwmca in 4 minutes and 31 seconds (queued for 4 seconds)
latest
Status Job ID Name Coverage
  Build
failed #190471
docker
build_linux_36

00:04:31

failed #190472
docker
build_linux_37

00:04:24

failed #190469
macosx
build_macosx_36

00:03:57

failed #190470
macosx
build_macosx_37

00:03:49

 
Name Stage Failure
failed
build_linux_36 Build
  File "/scratch/builds/bob/bob.pad.face/miniconda/conda-bld/bob.pad.face_1582708565223/_test_env_placehold_placehold_placehold_placehold_placehold_placehold_placehold_placehold_placehold_placehold_placehold_placehold_placehold_placehold_placehold_placehold_pla/lib/python3.6/site-packages/bob/pad/face/database/__init__.py", line 13, in <module>
from .hqwmca import HQWMCAPadDatabase
File "/scratch/builds/bob/bob.pad.face/miniconda/conda-bld/bob.pad.face_1582708565223/_test_env_placehold_placehold_placehold_placehold_placehold_placehold_placehold_placehold_placehold_placehold_placehold_placehold_placehold_placehold_placehold_placehold_pla/lib/python3.6/site-packages/bob/pad/face/database/hqwmca.py", line 10, in <module>
from bob.db.hqwmca.attack_dictionaries import idiap_type_id_config
ModuleNotFoundError: No module named 'bob.db.hqwmca'
Tests failed for bob.pad.face-2.2.2b0-py36hbc7a269_0.conda - moving package to /scratch/builds/bob/bob.pad.face/miniconda/conda-bld/broken
WARNING:conda_build.build:Tests failed for bob.pad.face-2.2.2b0-py36hbc7a269_0.conda - moving package to /scratch/builds/bob/bob.pad.face/miniconda/conda-bld/broken
TESTS FAILED: bob.pad.face-2.2.2b0-py36hbc7a269_0.conda
ERROR: Job failed: exit code 1
failed
build_linux_37 Build
  File "/scratch/builds/bob/bob.pad.face/miniconda/conda-bld/bob.pad.face_1582708564039/_test_env_placehold_placehold_placehold_placehold_placehold_placehold_placehold_placehold_placehold_placehold_placehold_placehold_placehold_placehold_placehold_placehold_pla/lib/python3.7/site-packages/bob/pad/face/database/__init__.py", line 13, in <module>
from .hqwmca import HQWMCAPadDatabase
File "/scratch/builds/bob/bob.pad.face/miniconda/conda-bld/bob.pad.face_1582708564039/_test_env_placehold_placehold_placehold_placehold_placehold_placehold_placehold_placehold_placehold_placehold_placehold_placehold_placehold_placehold_placehold_placehold_pla/lib/python3.7/site-packages/bob/pad/face/database/hqwmca.py", line 10, in <module>
from bob.db.hqwmca.attack_dictionaries import idiap_type_id_config
ModuleNotFoundError: No module named 'bob.db.hqwmca'
Tests failed for bob.pad.face-2.2.2b0-py37hbc7a269_0.conda - moving package to /scratch/builds/bob/bob.pad.face/miniconda/conda-bld/broken
WARNING:conda_build.build:Tests failed for bob.pad.face-2.2.2b0-py37hbc7a269_0.conda - moving package to /scratch/builds/bob/bob.pad.face/miniconda/conda-bld/broken
TESTS FAILED: bob.pad.face-2.2.2b0-py37hbc7a269_0.conda
ERROR: Job failed: exit code 1
failed
build_macosx_36 Build
  File "/Users/gitlab/builds/b6d3167a/0/bob/bob.pad.face/miniconda/conda-bld/bob.pad.face_1582708551943/_test_env_placehold_placehold_placehold_placehold_placehold_placehold_placehold_placehold_placehold_placehold_placehold_placehold_placehold_placehold_placeho/lib/python3.6/site-packages/bob/pad/face/database/__init__.py", line 13, in <module>
from .hqwmca import HQWMCAPadDatabase
File "/Users/gitlab/builds/b6d3167a/0/bob/bob.pad.face/miniconda/conda-bld/bob.pad.face_1582708551943/_test_env_placehold_placehold_placehold_placehold_placehold_placehold_placehold_placehold_placehold_placehold_placehold_placehold_placehold_placehold_placeho/lib/python3.6/site-packages/bob/pad/face/database/hqwmca.py", line 10, in <module>
from bob.db.hqwmca.attack_dictionaries import idiap_type_id_config
ModuleNotFoundError: No module named 'bob.db.hqwmca'
Tests failed for bob.pad.face-2.2.2b0-py36hbc7a269_0.conda - moving package to /Users/gitlab/builds/b6d3167a/0/bob/bob.pad.face/miniconda/conda-bld/broken
WARNING:conda_build.build:Tests failed for bob.pad.face-2.2.2b0-py36hbc7a269_0.conda - moving package to /Users/gitlab/builds/b6d3167a/0/bob/bob.pad.face/miniconda/conda-bld/broken
TESTS FAILED: bob.pad.face-2.2.2b0-py36hbc7a269_0.conda
ERROR: Job failed: exit status 1
failed
build_macosx_37 Build
  File "/Users/gitlab/builds/b6d3167a/1/bob/bob.pad.face/miniconda/conda-bld/bob.pad.face_1582708550371/_test_env_placehold_placehold_placehold_placehold_placehold_placehold_placehold_placehold_placehold_placehold_placehold_placehold_placehold_placehold_placeho/lib/python3.7/site-packages/bob/pad/face/database/__init__.py", line 13, in <module>
from .hqwmca import HQWMCAPadDatabase
File "/Users/gitlab/builds/b6d3167a/1/bob/bob.pad.face/miniconda/conda-bld/bob.pad.face_1582708550371/_test_env_placehold_placehold_placehold_placehold_placehold_placehold_placehold_placehold_placehold_placehold_placehold_placehold_placehold_placehold_placeho/lib/python3.7/site-packages/bob/pad/face/database/hqwmca.py", line 10, in <module>
from bob.db.hqwmca.attack_dictionaries import idiap_type_id_config
ModuleNotFoundError: No module named 'bob.db.hqwmca'
Tests failed for bob.pad.face-2.2.2b0-py37hbc7a269_0.conda - moving package to /Users/gitlab/builds/b6d3167a/1/bob/bob.pad.face/miniconda/conda-bld/broken
WARNING:conda_build.build:Tests failed for bob.pad.face-2.2.2b0-py37hbc7a269_0.conda - moving package to /Users/gitlab/builds/b6d3167a/1/bob/bob.pad.face/miniconda/conda-bld/broken
TESTS FAILED: bob.pad.face-2.2.2b0-py37hbc7a269_0.conda
ERROR: Job failed: exit status 1