[batl] Add a 2D Print Replay attack protocol

4 jobs for databases in 17 minutes and 59 seconds (queued for 1 second)
Status Job ID Name Coverage
  Build
failed #187055
docker
build_linux_36

00:09:00

59.0%
failed #187056
docker
build_linux_37

00:08:53

59.0%
failed #187053
macosx
build_macosx_36

00:17:59

59.0%
failed #187054
macosx
build_macosx_37

00:17:59

59.0%
 
Name Stage Failure
failed
build_macosx_36 Build
TOTAL                                                                              2713   1111    59%
----------------------------------------------------------------------
Ran 36 tests in 307.106s

FAILED (SKIP=2, failures=1)
Tests failed for bob.pad.face-2.2.2b0-py36hbc7a269_23.conda - moving package to /Users/gitlab/builds/f6f95b82/0/bob/bob.pad.face/miniconda/conda-bld/broken
WARNING:conda_build.build:Tests failed for bob.pad.face-2.2.2b0-py36hbc7a269_23.conda - moving package to /Users/gitlab/builds/f6f95b82/0/bob/bob.pad.face/miniconda/conda-bld/broken
TESTS FAILED: bob.pad.face-2.2.2b0-py36hbc7a269_23.conda
ERROR: Job failed: exit status 1
failed
build_macosx_37 Build
TOTAL                                                                              2713   1111    59%
----------------------------------------------------------------------
Ran 36 tests in 308.648s

FAILED (SKIP=2, failures=1)
Tests failed for bob.pad.face-2.2.2b0-py37hbc7a269_22.conda - moving package to /Users/gitlab/builds/f6f95b82/1/bob/bob.pad.face/miniconda/conda-bld/broken
WARNING:conda_build.build:Tests failed for bob.pad.face-2.2.2b0-py37hbc7a269_22.conda - moving package to /Users/gitlab/builds/f6f95b82/1/bob/bob.pad.face/miniconda/conda-bld/broken
TESTS FAILED: bob.pad.face-2.2.2b0-py37hbc7a269_22.conda
ERROR: Job failed: exit status 1
failed
build_linux_36 Build
TOTAL                                                                              2713   1111    59%
----------------------------------------------------------------------
Ran 36 tests in 269.986s

FAILED (SKIP=2, failures=1)
Tests failed for bob.pad.face-2.2.2b0-py36hbc7a269_22.conda - moving package to /scratch/builds/bob/bob.pad.face/miniconda/conda-bld/broken
WARNING:conda_build.build:Tests failed for bob.pad.face-2.2.2b0-py36hbc7a269_22.conda - moving package to /scratch/builds/bob/bob.pad.face/miniconda/conda-bld/broken
TESTS FAILED: bob.pad.face-2.2.2b0-py36hbc7a269_22.conda
ERROR: Job failed: exit code 1
failed
build_linux_37 Build
TOTAL                                                                              2713   1111    59%
----------------------------------------------------------------------
Ran 36 tests in 264.086s

FAILED (SKIP=2, failures=1)
Tests failed for bob.pad.face-2.2.2b0-py37hbc7a269_22.conda - moving package to /scratch/builds/bob/bob.pad.face/miniconda/conda-bld/broken
WARNING:conda_build.build:Tests failed for bob.pad.face-2.2.2b0-py37hbc7a269_22.conda - moving package to /scratch/builds/bob/bob.pad.face/miniconda/conda-bld/broken
TESTS FAILED: bob.pad.face-2.2.2b0-py37hbc7a269_22.conda
ERROR: Job failed: exit code 1