Change the tests score files input to CSV scores.

4 jobs for score-writer in 12 minutes and 42 seconds (queued for 3 seconds)
Status Job ID Name Coverage
  Build
failed #234800
docker
build_linux_37

00:03:59

failed #234801
docker
build_linux_38

00:03:53

failed #234798
intel macos
build_macos_intel_37

00:10:44

failed #234799
intel macos
build_macos_intel_38

00:12:38

 
Name Stage Failure
failed
build_macos_intel_38 Build
Tests failed for bob.pad.base-3.0.1b0-py38h737230c_41.conda - moving package to /Users/gitlab/builds/nrU4yQP1/1/bob/bob.pad.base/miniconda/conda-bld/broken
TESTS FAILED: bob.pad.base-3.0.1b0-py38h737230c_41.conda
Uploading artifacts for failed job
Uploading artifacts...
Runtime platform
arch=amd64 os=darwin pid=71617 revision=7a6612da version=13.12.0
WARNING: coverage.xml: no matching files
ERROR: No files to upload
Cleaning up file based variables
ERROR: Job failed: exit status 1
failed
build_macos_intel_37 Build
Tests failed for bob.pad.base-3.0.1b0-py37h737230c_40.conda - moving package to /Users/gitlab/builds/nrU4yQP1/0/bob/bob.pad.base/miniconda/conda-bld/broken
TESTS FAILED: bob.pad.base-3.0.1b0-py37h737230c_40.conda
Uploading artifacts for failed job
Uploading artifacts...
Runtime platform
arch=amd64 os=darwin pid=69489 revision=7a6612da version=13.12.0
WARNING: coverage.xml: no matching files
ERROR: No files to upload
Cleaning up file based variables
ERROR: Job failed: exit status 1
failed
build_linux_37 Build
FAILED (errors=1)
Tests failed for bob.pad.base-3.0.1b0-py37h4c9762e_45.conda - moving package to /scratch/builds/bob/bob.pad.base/miniconda/conda-bld/broken
TESTS FAILED: bob.pad.base-3.0.1b0-py37h4c9762e_45.conda
Uploading artifacts for failed job
Uploading artifacts...
WARNING: coverage.xml: no matching files
ERROR: No files to upload
Cleaning up file based variables
ERROR: Job failed: exit code 1
failed
build_linux_38 Build
FAILED (errors=1)
Tests failed for bob.pad.base-3.0.1b0-py38h4c9762e_43.conda - moving package to /scratch/builds/bob/bob.pad.base/miniconda/conda-bld/broken
TESTS FAILED: bob.pad.base-3.0.1b0-py38h4c9762e_43.conda
Uploading artifacts for failed job
Uploading artifacts...
WARNING: coverage.xml: no matching files
ERROR: No files to upload
Cleaning up file based variables
ERROR: Job failed: exit code 1