Put back the correct function for split PAI

4 jobs for score-writer in 7 minutes and 39 seconds (queued for 5 seconds)
Status Job ID Name Coverage
  Build
failed #234616
docker
build_linux_37

00:03:39

failed #234617
docker
build_linux_38

00:03:33

failed #234614
intel macos
build_macos_intel_37

00:07:39

failed #234615
intel macos
build_macos_intel_38

00:07:38

 
Name Stage Failure
failed
build_macos_intel_37 Build
Tests failed for bob.pad.base-3.0.1b0-py37h737230c_40.conda - moving package to /Users/gitlab/builds/nrU4yQP1/0/bob/bob.pad.base/miniconda/conda-bld/broken
TESTS FAILED: bob.pad.base-3.0.1b0-py37h737230c_40.conda
Uploading artifacts for failed job
Uploading artifacts...
Runtime platform
arch=amd64 os=darwin pid=20293 revision=7a6612da version=13.12.0
WARNING: coverage.xml: no matching files
ERROR: No files to upload
Cleaning up file based variables
ERROR: Job failed: exit status 1
failed
build_macos_intel_38 Build
Tests failed for bob.pad.base-3.0.1b0-py38h737230c_41.conda - moving package to /Users/gitlab/builds/nrU4yQP1/1/bob/bob.pad.base/miniconda/conda-bld/broken
TESTS FAILED: bob.pad.base-3.0.1b0-py38h737230c_41.conda
Uploading artifacts for failed job
Uploading artifacts...
Runtime platform
arch=amd64 os=darwin pid=20260 revision=7a6612da version=13.12.0
WARNING: coverage.xml: no matching files
ERROR: No files to upload
Cleaning up file based variables
ERROR: Job failed: exit status 1
failed
build_linux_37 Build
FAILED (errors=1, failures=4)
Tests failed for bob.pad.base-3.0.1b0-py37h4c9762e_45.conda - moving package to /scratch/builds/bob/bob.pad.base/miniconda/conda-bld/broken
TESTS FAILED: bob.pad.base-3.0.1b0-py37h4c9762e_45.conda
Uploading artifacts for failed job
Uploading artifacts...
WARNING: coverage.xml: no matching files
ERROR: No files to upload
Cleaning up file based variables
ERROR: Job failed: exit code 1
failed
build_linux_38 Build
FAILED (errors=1, failures=4)
Tests failed for bob.pad.base-3.0.1b0-py38h4c9762e_43.conda - moving package to /scratch/builds/bob/bob.pad.base/miniconda/conda-bld/broken
TESTS FAILED: bob.pad.base-3.0.1b0-py38h4c9762e_43.conda
Uploading artifacts for failed job
Uploading artifacts...
WARNING: coverage.xml: no matching files
ERROR: No files to upload
Cleaning up file based variables
ERROR: Job failed: exit code 1