Use a less biometric-related name for functions; Add confidence interval and...

Use a less biometric-related name for functions; Add confidence interval and credible region details; Use python-vectorisation instead of numba for most contents in our library
4 jobs for andres-upgrades in 4 minutes and 33 seconds (queued for 2 seconds)
latest
Status Job ID Name Coverage
  Build
failed #234582
docker
build_linux_37

00:03:06

failed #234583
docker
build_linux_38

00:03:08

failed #234580
intel macos
build_macos_intel_37

00:04:33

failed #234581
intel macos
build_macos_intel_38

00:04:30

 
Name Stage Failure
failed
build_macos_intel_37 Build
Tests failed for bob.measure-4.2.4b0-py37hbd54c0a_52.conda - moving package to /Users/gitlab/builds/nrU4yQP1/0/bob/bob.measure/miniconda/conda-bld/broken
TESTS FAILED: bob.measure-4.2.4b0-py37hbd54c0a_52.conda
Uploading artifacts for failed job
Uploading artifacts...
Runtime platform
arch=amd64 os=darwin pid=67874 revision=7a6612da version=13.12.0
WARNING: coverage.xml: no matching files
ERROR: No files to upload
Cleaning up file based variables
ERROR: Job failed: exit status 1
failed
build_macos_intel_38 Build
Tests failed for bob.measure-4.2.4b0-py38hbd54c0a_52.conda - moving package to /Users/gitlab/builds/nrU4yQP1/1/bob/bob.measure/miniconda/conda-bld/broken
TESTS FAILED: bob.measure-4.2.4b0-py38hbd54c0a_52.conda
Uploading artifacts for failed job
Uploading artifacts...
Runtime platform
arch=amd64 os=darwin pid=67858 revision=7a6612da version=13.12.0
WARNING: coverage.xml: no matching files
ERROR: No files to upload
Cleaning up file based variables
ERROR: Job failed: exit status 1
failed
build_linux_38 Build
ModuleNotFoundError: No module named 'numba'
Tests failed for bob.measure-4.2.4b0-py38hc9edb83_53.conda - moving package to /scratch/builds/bob/bob.measure/miniconda/conda-bld/broken
TESTS FAILED: bob.measure-4.2.4b0-py38hc9edb83_53.conda
Uploading artifacts for failed job
Uploading artifacts...
WARNING: coverage.xml: no matching files
ERROR: No files to upload
Cleaning up file based variables
ERROR: Job failed: exit code 1
failed
build_linux_37 Build
ModuleNotFoundError: No module named 'numba'
Tests failed for bob.measure-4.2.4b0-py37hc9edb83_53.conda - moving package to /scratch/builds/bob/bob.measure/miniconda/conda-bld/broken
TESTS FAILED: bob.measure-4.2.4b0-py37hc9edb83_53.conda
Uploading artifacts for failed job
Uploading artifacts...
WARNING: coverage.xml: no matching files
ERROR: No files to upload
Cleaning up file based variables
ERROR: Job failed: exit code 1